program: Gaussian 09
title: 000092261
version: EM64L-G09RevD.01
frameworkgroup: C1[X(C6H2Cl4O2)]
method: RPBEPBE
basis: SDD
operation: Freq
keyword: #p
keyword: freq=noraman
keyword: PBEPBE/SDD
title: #p freq=noraman PBEPBE/SDD
converged: NO NO NO YES
title: Mulliken charges:
elementType: Cl Cl Cl Cl O O C C C C C C H H
charge: 0.017099 0.009964 0.056954 0.049412 -0.382238 -0.386147 0.593845 0.574843 -0.535834 -0.305662 -0.354526 -0.074124 0.367453 0.368961
chargesum: 0.00000
title: Mulliken charges with hydrogens summed into heavy atoms:
elementType: Cl Cl Cl Cl O O C C C C C C
charge: 0.017099 0.009964 0.056954 0.049412 -0.014785 -0.017186 0.593845 0.574843 -0.535834 -0.305662 -0.354526 -0.074124
polarizability: 1.52714731e+02 1.00981789e-01 1.42546054e+02 1.94207546e-03 -5.08860650e-03 3.91041539e+01
1716.lowfreq: -0.0019 -0.0013 0.0016 2.7230 6.0982 8.6372 73.3645 94.4589 112.4753
frequency: 73.3596 94.4587 112.4751 183.4739 188.6040 192.9678 202.1152 279.1910 297.6531 314.0247 329.3740 335.7993 350.3816 373.5759 446.3227 464.3864 498.0305 583.8693 635.7634 648.5430 686.5803 711.6153 778.2895 866.5884 1033.9552 1076.6820 1186.0251 1205.9794 1309.0411 1376.7804 1416.1498 1433.7474 1570.4939 1593.8920 3482.4111 3490.4483
redmass: 30.0280 11.1395 17.1834 9.3171 27.5441 29.6023 30.5334 8.4131 12.4650 9.1902 9.8073 9.2787 27.6905 13.0254 1.1203 1.1100 11.1181 11.3070 10.5292 6.8610 9.6048 11.1010 11.3459 12.6731 10.0551 11.4600 1.5637 1.4849 7.6694 7.5945 5.7059 5.1865 7.6883 8.7595 1.0649 1.0650
irintensity: 0.0056 0.0168 0.0793 1.7961 0.1004 0.1180 0.0072 3.9065 7.0678 0.3368 2.5191 11.2137 1.0354 0.4976 101.4170 190.2267 6.3694 0.0652 0.0006 12.3826 81.1119 71.8180 5.8839 12.9717 46.7286 8.6462 301.4343 176.4050 83.2462 48.0740 142.2593 73.6073 23.3587 29.2775 74.0972 72.3239
temp: 298.150 k
press: 1.00000 atm
elementType: 17 17 17 17 8 8 6 6 6 6 6 6 1 1
symmnumber: 1
zpe: 178381.4 jmol-1
zpe.correction: 0.067942 hartree
zpe.thermalcorrener: 0.079740 hartree
zpe.thermalcorrenthalpy: 0.080684 hartree
zpe.thermalcorrgfe: 0.029102 hartree
zpe.sumelectzpe: -2219.627790 hartree
zpe.sumelectthermal: -2219.615992 hartree
zpe.sumelectthermalent: -2219.615047 hartree
zpe.sumelectthermalfe: -2219.666629 hartree
dipole: 1.2485 1.5848 0.0000
dipole: 2.0175
quadrupole: -94.9611 -92.8009 -96.7915
quadrupole: -5.1858 0.0002 0.0001
quadrupole: -0.1099 2.0503 -1.9404 -5.1858 0.0002 0.0001
hfenergy: -2219.6957314 hartree
pointgroup: C01 [X(C6H2Cl4O2)]
dipole: -0.5003776 -0.6161584 -0.0000103 debye
dipolederiv: -0.6737648 -0.0080548 0.0000117 0.0463444 -0.1125229 -0.0000058 0.0000131 -0.0000052 0.0037723 -0.2163261 0.1981041 0.0000136 0.2233185 -0.5504805 -0.0000264 0.0000113 -0.0000175 0.0041715 -0.1477479 -0.2756292 -0.0000129 -0.2415384 -0.5072637 -0.0000259 -0.0000111 -0.0000283 0.0134538 -0.6268587 -0.0061033 0.0000088 0.0037675 -0.0042886 -0.0000009 -0.0000012 0. 0.0078585 -0.5519852 0.5664341 0.0000412 0.6077764 -0.9229741 -0.0000325 0.0000548 -0.0000525 -0.374637 -0.3771013 -0.5074356 -0.0000145 -0.4533545 -1.1222801 -0.00003 -0.0000136 -0.0000296 -0.3780012 0.3576957 -0.6925713 -0.0000481 -0.5312381 0.727568 0.0000369 -0.0000503 0.0000519 0.1855714 0.2138269 0.6003726 0.0000202 0.3864566 0.868365 0.0000226 0.0000084 0.0000159 0.2060209 0.9283396 0.0304859 -0.0000157 -0.0011598 -0.3101007 -0.0000073 -0.0000091 -0.0000054 -0.1802104 -0.1812954 -0.7010506 -0.0000304 -0.3048584 0.4779503 0.0000269 -0.0000092 0.0000243 -0.1485198 -0.1803792 0.7254503 0.0000414 0.3524517 0.5782928 0.0000374 0.0000171 0.0000348 -0.1297986 0.930976 0.0214366 -0.0000083 -0.0605358 0.0879716 0.0000061 -0.000002 0.0000029 0.0388822 0.2517427 -0.0939476 -0.000007 -0.1345805 0.3972904 -0.0000025 -0.0000109 0.0000027 0.3750879 0.2728778 0.1425089 0. 0.1071504 0.3924726 0.0000015 0.0000026 0.000006 0.3763485 unknown
polarizability: 152.7154917|-0.0496634|142.5452942|-0.0018665|0.0051168|39.1041539 unknown
InChI: InChI=1S/C6H2Cl4O2/c7-1-2(8)5(11)4(10)6(12)3(1)9/h11-12H
charge 0 multiplicity 1
14 atoms
Cl -3.228838 -0.019682 0.000061
Cl 1.571422 -2.805978 -0.000151
Cl 1.51847 2.820568 0.000135
Cl 3.193394 0.024962 -0.000051
O  -1.405781 2.431958 0.000166
O  -1.449277 -2.427977 -0.000082
C  -0.740291 1.216692 0.000069
C  -0.717559 -1.250418 -0.000051
C  -1.417447 -0.026639 0.000025
C  0.700227 -1.21165 -0.000084
C  0.679084 1.232011 0.000046
C  1.3950 0.015285 -0.00004
H  -2.390359 2.283068 0.000155
H  -0.836246 -3.212001 -0.000096
