program: Gaussian 09
title: 000092257
version: EM64L-G09RevD.01
frameworkgroup: C1[X(C7H14O6)]
method: RPBEPBE
basis: SDD
operation: Freq
keyword: #pfreq=noraman
keyword: PBEPBE/SDD
title: #p freq=noraman PBEPBE/SDD
converged: YES YES NO NO
title: Mulliken charges:
elementType: O O O O O O C C C C C C C H H H H H H H H H H H H H H
charge: -0.247407 -0.463329 -0.473427 -0.450194 -0.288181 -0.446227 -0.177729 -0.152133 0.029123 -0.112087 -0.060182 -0.383940 -0.503975 0.240326 0.252098 0.255168 0.236865 0.241685 0.219786 0.166618 0.344984 0.366285 0.366772 0.348949 0.205952 0.255324 0.228876
chargesum: 0.00000
title: Mulliken charges with hydrogens summed into heavy atoms:
elementType: O O O O O O C C C C C C C
charge: -0.247407 -0.118345 -0.107142 -0.083422 -0.288181 -0.097278 0.062597 0.099965 0.284291 0.124778 0.181502 0.002463 0.186177
polarizability: 1.03217791e+02 -2.18095300e+00 1.01476062e+02 4.41349080e-01 -1.11771459e+00 7.89112556e+01
1716.lowfreq: -10.4529 -7.4065 0.0009 0.0009 0.0011 4.1430 52.4308 69.0528 87.2916
frequency: 52.4211 69.0109 87.2777 104.0034 132.2048 146.7783 170.0437 176.5202 218.3182 238.8140 245.7836 277.1655 281.5172 315.4164 348.7197 376.6393 398.5731 431.8072 467.5050 482.8692 489.8220 552.6341 588.8809 659.9495 764.5139 797.9697 853.5264 888.3958 920.0135 965.2707 978.9419 994.8473 1018.0824 1027.1899 1031.7386 1050.8135 1072.0863 1094.6410 1120.0175 1124.5594 1149.3696 1166.9453 1202.6058 1216.0557 1227.2351 1239.4245 1253.0296 1284.8096 1301.9697 1313.4695 1328.3564 1343.2724 1355.0235 1369.0396 1385.7014 1397.8062 1418.4073 1431.0466 1454.9780 1455.8853 1481.7826 2929.8543 2958.2239 2992.4175 3000.0826 3003.6731 3013.0978 3021.6991 3024.3928 3056.2500 3119.8004 3509.6744 3551.2340 3583.6276 3584.2550
redmass: 4.7887 3.5904 3.2992 5.2291 1.4150 1.3373 2.7943 2.3999 3.3502 4.7955 3.9625 1.8825 1.7630 6.1237 3.5294 5.6532 4.7720 3.5215 1.2012 1.4875 2.7412 3.5522 4.6117 4.7448 4.4463 3.6064 3.3512 4.9395 3.8935 4.6781 4.8761 5.6862 3.3580 2.4025 3.4827 2.7456 2.9191 2.2943 1.3714 2.0984 1.3423 1.1756 1.3000 1.2829 1.1603 1.1139 1.2647 1.2756 1.2066 1.2100 1.2908 1.2613 1.3868 1.4768 1.5943 1.7971 1.5672 1.1401 1.0558 1.0759 1.0530 1.0612 1.0347 1.0824 1.0856 1.0903 1.0893 1.0888 1.0868 1.0999 1.1018 1.0647 1.0653 1.0667 1.0669
irintensity: 3.8971 0.6964 6.3014 1.6722 22.4324 130.7125 0.8627 5.3510 20.7729 16.1310 25.9743 33.7644 105.1321 5.3368 22.8222 5.4808 3.7432 30.2212 119.8755 119.9729 51.9350 21.9964 26.0139 53.3004 31.7204 11.7348 26.1221 71.4230 70.6422 35.1890 132.4371 124.0921 32.9882 54.3862 96.1112 19.4592 20.7281 84.7302 3.4881 10.1319 8.7511 60.7528 18.5231 13.9582 13.8600 29.4430 16.7492 0.6224 4.0229 20.3791 9.1108 5.3674 6.4618 24.6770 14.7468 32.0171 1.9487 6.0748 13.7206 3.0162 9.4499 90.9510 65.9331 7.5184 6.9417 13.6782 22.6549 81.3588 40.5881 33.5125 22.4037 27.1843 22.3664 4.5423 7.6458
temp: 298.150 k
press: 1.00000 atm
elementType: 8 8 8 8 8 8 6 6 6 6 6 6 6 1 1 1 1 1 1 1 1 1 1 1 1 1 1
symmnumber: 1
zpe: 569062.2 jmol-1
zpe.correction: 0.216744 hartree
zpe.thermalcorrener: 0.231449 hartree
zpe.thermalcorrenthalpy: 0.232393 hartree
zpe.thermalcorrgfe: 0.175695 hartree
zpe.sumelectzpe: -725.358686 hartree
zpe.sumelectthermal: -725.343981 hartree
zpe.sumelectthermalent: -725.343037 hartree
zpe.sumelectthermalfe: -725.399736 hartree
dipole: -1.9861 -3.0825 0.7087
dipole: 3.7348
quadrupole: -74.5744 -63.9417 -82.9353
quadrupole: -1.8140 -4.2099 -6.3262
quadrupole: -0.7573 9.8755 -9.1182 -1.8140 -4.2099 -6.3262
hfenergy: -725.5754304 hartree
pointgroup: C01 [X(C7H14O6)]
dipole: -0.8045024 -1.2147861 0.1900469 debye
polarizability: 102.9690059|-2.1303012|101.5267466|2.3980982|-0.8735784|79.1093563 unknown
InChI: InChI=1S/C7H14O6/c1-12-7-6(11)5(10)4(9)3(2-8)13-7/h3-11H,2H2,1H3
charge 0 multiplicity 1
27 atoms
O  -0.950525 0.398913 0.854996
O  0.898254 -2.447831 -0.824069
O  2.965917 -0.618743 -0.261344
O  1.910009 0.910099 1.738347
O  -0.417335 2.049119 -0.826665
O  -3.176725 -1.336594 -0.171227
C  0.614489 -1.30062 0.063136
C  1.567398 -0.201729 -0.432874
C  -0.839018 -0.78176 -0.037419
C  1.409366 1.097624 0.376212
C  -0.072136 1.50453 0.475699
C  -1.906498 -1.761469 0.432852
C  -1.794261 2.571329 -0.88395
H  0.846385 -1.545924 1.1208
H  1.343268 -0.005702 -1.500641
H  -1.05516 -0.491918 -1.085747
H  1.962363 1.909993 -0.13519
H  -0.220041 2.241394 1.288493
H  -1.9472 -1.739667 1.540992
H  -1.655923 -2.791886 0.094841
H  0.488997 -3.270363 -0.45832
H  3.044304 -1.531082 -0.642921
H  2.775012 0.428175 1.641429
H  -3.933996 -1.701457 0.349957
H  -1.931764 3.390331 -0.148854
H  -2.528444 1.769949 -0.683102
H  -1.920636 2.96139 -1.905229
