program: Gaussian 09
title: 000092302
version: EM64L-G09RevD.01
frameworkgroup: C1[X(C14H15O4P)]
method: RPBEPBE
basis: SDD
operation: Freq
keyword: #p
keyword: freq=noraman
keyword: PBEPBE/SDD
title: #p freq=noraman PBEPBE/SDD
converged: YES YES NO NO
title: Mulliken charges:
elementType: P O O O O C C C C C C C C C C C C C C H H H H H H H H H H H H H H H
charge: 1.316904 -0.555389 -0.532915 -0.638495 -0.568116 0.229486 0.226594 0.322611 0.322155 -0.319736 -0.329238 -0.382808 -0.381571 -0.787069 -0.786135 -0.216809 -0.216750 -0.233142 -0.233746 0.266268 0.269351 0.235844 0.235670 0.263687 0.239302 0.215748 0.255869 0.244962 0.214524 0.233045 0.232524 0.229204 0.228972 0.399201
chargesum: 0.00000
title: Mulliken charges with hydrogens summed into heavy atoms:
elementType: P O O O O C C C C C C C C C C C C C C
charge: 1.316904 -0.555389 -0.532915 -0.239294 -0.568116 0.229486 0.226594 0.322611 0.322155 -0.053468 -0.059887 -0.146964 -0.145901 -0.068332 -0.070780 0.016236 0.015773 -0.003938 -0.004774
polarizability: 2.31539351e+02 -1.17769544e+01 1.83581980e+02 -1.03119218e+01 8.48585580e+00 1.42105688e+02
1716.lowfreq: -6.9118 -0.0010 0.0017 0.0018 5.2694 9.1788 18.4933 19.7490 24.3796
frequency: 18.1494 19.5077 24.0487 47.1741 72.3470 77.7180 123.1066 134.3157 136.4264 162.0272 171.4835 191.6281 215.9205 233.7076 244.7967 266.2715 297.0810 332.3367 345.5644 369.7880 433.7279 439.3776 441.7565 461.1040 481.4939 492.3862 540.8468 545.7390 575.3482 575.8394 623.1019 678.2058 713.2848 715.4104 724.1605 763.1452 766.6653 767.0103 774.4265 841.8242 847.6765 862.7593 863.5508 943.1394 943.8928 983.0831 984.1190 988.0143 990.4660 1014.4489 1039.6228 1040.6376 1051.0044 1051.6241 1066.2840 1091.1460 1097.8583 1154.2571 1161.5529 1172.6930 1173.0733 1225.6036 1227.0445 1280.6313 1280.9988 1376.0792 1376.4767 1402.1822 1406.3092 1427.0878 1428.0307 1460.4202 1463.1280 1475.5437 1476.5037 1479.8817 1483.9632 1588.1171 1589.4625 1610.8439 1611.6394 2984.2043 2986.3351 3064.2972 3067.2490 3094.2094 3096.0934 3127.0890 3127.5147 3141.6967 3142.4402 3157.5416 3157.9215 3172.6104 3173.3790 3585.5417
redmass: 4.3014 5.4996 3.8592 5.9327 5.9373 5.7730 1.0834 1.4499 1.7585 4.1443 3.2064 3.9221 2.0232 4.0481 3.2446 5.2487 4.8225 3.1827 5.7119 5.8202 3.5875 4.0547 3.2178 4.0273 5.2483 6.1343 4.3626 4.4293 5.8805 6.0027 8.6831 7.5950 2.9042 2.7059 7.5098 2.6374 1.4540 1.8557 5.1808 5.8515 6.1740 1.3416 1.3188 1.3798 1.3759 1.3253 1.3229 1.6242 1.6208 1.7673 2.0452 2.0442 1.5245 1.5251 2.9953 2.8371 2.4320 1.9071 2.0801 1.0591 1.0687 2.6136 2.6342 1.4679 1.4659 7.1666 7.2253 1.2519 1.2419 2.0175 2.0458 1.0488 1.0602 1.7024 2.0628 1.5568 1.2734 5.9535 5.9542 7.2031 7.1506 1.0369 1.0366 1.0971 1.0972 1.1001 1.1002 1.0868 1.0866 1.0898 1.0899 1.0946 1.0946 1.1001 1.1000 1.0662
irintensity: 0.3712 0.3122 0.0971 1.5261 0.1551 3.0021 1.8451 7.5032 3.7348 6.4870 3.7269 2.7554 84.0153 7.6399 2.7423 1.7090 2.3885 34.0915 33.3694 28.5363 3.3423 6.8098 18.0891 38.3162 8.6220 41.2992 0.3529 5.1657 1.1577 2.3013 5.0733 63.4098 16.6207 4.0052 108.9363 12.7042 49.1039 182.7591 187.7224 73.1090 219.9234 7.1463 0.5987 2.2452 1.5534 0.2071 0.0824 2.0456 0.7933 26.8801 23.0748 17.9456 7.3207 12.7269 116.8781 194.4236 31.1246 105.5177 21.9590 2.2171 0.9444 25.7937 8.0673 1.0167 0.2490 1.8555 3.4881 7.0483 19.2733 22.5438 7.4527 7.6746 13.1983 9.3756 29.1316 115.8127 19.0657 13.2902 8.9648 5.2543 1.5191 21.2279 16.6999 11.3424 11.5521 25.1710 21.2860 4.4667 5.1831 13.4390 13.7177 29.1259 19.5614 10.6094 9.9875 85.2583
temp: 298.150 k
press: 1.00000 atm
elementType: 15 8 8 8 8 6 6 6 6 6 6 6 6 6 6 6 6 6 6 1 1 1 1 1 1 1 1 1 1 1 1 1 1 1
symmnumber: 1
zpe: 676531.5 jmol-1
zpe.correction: 0.257677 hartree
zpe.thermalcorrener: 0.277143 hartree
zpe.thermalcorrenthalpy: 0.278087 hartree
zpe.thermalcorrgfe: 0.207154 hartree
zpe.sumelectzpe: -1183.225186 hartree
zpe.sumelectthermal: -1183.205720 hartree
zpe.sumelectthermalent: -1183.204776 hartree
zpe.sumelectthermalfe: -1183.275709 hartree
dipole: -0.6554 0.9015 -0.2697
dipole: 1.1467
quadrupole: -103.8436 -116.1996 -111.6837
quadrupole: -1.9225 -4.3132 -0.0400
quadrupole: 6.7320 -5.6240 -1.1080 -1.9225 -4.3132 -0.0400
hfenergy: -1183.4828632 hartree
pointgroup: C01 [X(C14H15O4P1)]
dipole: -0.181625 0.2233423 0.3473812 debye
polarizability: 224.509342|2.9153485|140.7170907|-22.2546084|5.6312578|192.0005865 unknown
InChI: InChI=1S/C14H15O4P/c1-11-7-3-5-9-13(11)17-19(15,16)18-14-10-6-4-8-12(14)2/h3-10,15H,1-2H3
charge 0 multiplicity 1
34 atoms
P  -0.013833 -1.532543 -0.142481
O  -0.617377 -0.006942 0.398059
O  1.630051 -1.357492 0.339193
O  -0.582963 -2.584628 1.090897
O  -0.315006 -1.997854 -1.630768
C  -1.994641 0.365447 0.219289
C  2.543327 -0.520958 -0.392251
C  -2.773306 0.527467 1.392919
C  3.114996 0.566918 0.31425
C  -2.487042 0.623296 -1.075261
C  2.892324 -0.84913 -1.717452
C  -4.103753 0.98332 1.212715
C  4.089444 1.330057 -0.377056
C  -2.19926 0.220023 2.759775
C  2.687457 0.887758 1.730565
C  -3.820116 1.067459 -1.219975
C  3.859358 -0.061293 -2.380429
C  -4.626796 1.250523 -0.073618
C  4.460802 1.026371 -1.707204
H  -1.839884 0.471277 -1.944828
H  2.412125 -1.697602 -2.215083
H  -4.735458 1.123996 2.097666
H  4.555429 2.177732 0.138973
H  -1.804587 -0.811593 2.799536
H  -1.352027 0.889698 2.996914
H  -2.965428 0.337144 3.544505
H  1.59645 1.059278 1.779687
H  2.904814 0.047102 2.41407
H  3.204689 1.787254 2.104353
H  -4.22028 1.269256 -2.219045
H  4.140048 -0.299978 -3.411625
H  -5.660142 1.598017 -0.179765
H  5.214516 1.637597 -2.215244
H  -0.68433 -3.525975 0.795418
