program: Gaussian 09
title: 000092227
version: EM64L-G09RevD.01
frameworkgroup: C1[X(C8H8O5)]
method: RPBEPBE
basis: SDD
operation: Freq
keyword: #p
keyword: freq=noraman
keyword: PBEPBE/SDD
title: #p freq=noraman PBEPBE/SDD
converged: YES YES NO NO
title: Mulliken charges:
elementType: O O O O O C C C C C C C C H H H H H H H H
charge: -0.231773 -0.413320 -0.415285 -0.228481 -0.228849 -0.241134 -0.239478 -0.163290 -0.227367 -0.224781 -0.207697 0.167480 0.168814 0.325252 0.314345 0.272270 0.293667 0.254150 0.257615 0.381567 0.386294
chargesum: 0.00000
title: Mulliken charges with hydrogens summed into heavy atoms:
elementType: O O O O O C C C C C C C C
charge: -0.231773 -0.031753 -0.028991 -0.228481 -0.228849 0.084118 0.074867 0.108981 0.066300 0.029370 0.049918 0.167480 0.168814
polarizability: 1.06495429e+02 3.65978637e+00 8.91161152e+01 5.32575780e+00 6.93682666e+00 7.92856581e+01
1716.lowfreq: -5.8765 0.0009 0.0009 0.0011 2.4088 15.4019 30.6007 41.8278 73.5428
frequency: 30.2289 41.7617 73.5063 136.1563 140.0751 187.6007 303.1590 341.4870 360.0585 424.1765 477.9770 517.5934 564.0002 583.2326 600.7454 626.2417 655.0872 666.2207 716.6330 732.1158 779.8156 800.4647 830.4904 865.1540 882.3627 914.0582 925.4779 952.1620 966.4304 972.6158 980.6947 1021.7602 1075.7778 1083.5284 1097.5256 1142.2507 1176.5890 1205.5848 1213.6068 1236.6004 1251.5436 1273.4390 1291.4677 1301.4138 1311.9417 1362.6298 1583.4191 1657.4311 1660.9858 3011.2556 3082.6550 3148.0492 3154.6639 3186.9589 3218.8159 3511.9959 3516.6702
redmass: 9.0413 9.8938 6.6965 5.4820 6.2715 5.6381 6.5693 6.0375 5.5404 4.7831 3.0441 3.2799 3.2003 2.6571 3.1945 1.8710 1.8958 2.1487 2.7422 3.6661 5.9366 5.4686 3.0011 3.6731 4.4428 2.3330 1.9225 3.6168 2.2700 3.0428 5.0383 2.5670 1.8265 1.8420 1.5140 1.1575 1.4237 1.2738 1.2739 1.3165 1.3700 1.5513 1.7215 1.8046 2.1809 2.0856 6.1845 9.4467 8.9307 1.0826 1.0844 1.0905 1.0948 1.0883 1.1113 1.0639 1.0641
irintensity: 1.9561 0.7806 0.5177 2.4215 2.4774 0.1079 3.9792 6.3043 6.9990 3.7272 3.7806 19.7183 43.2953 101.7154 47.1779 51.3808 56.3084 115.0025 31.4627 3.9228 12.5465 3.4442 101.5506 8.3336 26.3206 16.2840 9.0643 2.3932 2.3107 39.1802 41.0851 110.5075 136.6791 203.2048 39.2669 10.4602 27.4842 6.5365 1.9516 2.0778 2.2420 13.2101 11.1085 22.0591 37.1898 46.3066 2.3538 262.7346 192.8570 10.4160 1.5485 14.3419 1.5865 1.2594 4.7325 25.0275 30.2366
temp: 298.150 k
press: 1.00000 atm
elementType: 8 8 8 8 8 6 6 6 6 6 6 6 6 1 1 1 1 1 1 1 1
symmnumber: 1
zpe: 399710.3 jmol-1
zpe.correction: 0.152242 hartree
zpe.thermalcorrener: 0.163392 hartree
zpe.thermalcorrenthalpy: 0.164336 hartree
zpe.thermalcorrgfe: 0.113612 hartree
zpe.sumelectzpe: -684.768644 hartree
zpe.sumelectthermal: -684.757494 hartree
zpe.sumelectthermalent: -684.756550 hartree
zpe.sumelectthermalfe: -684.807274 hartree
dipole: -2.3214 -1.1837 -0.0522
dipole: 2.6063
quadrupole: -70.6624 -71.0915 -78.0616
quadrupole: -5.0734 1.2774 7.8479
quadrupole: 2.6094 2.1803 -4.7897 -5.0734 1.2774 7.8479
hfenergy: -684.9208856 hartree
pointgroup: C01 [X(C8H8O5)]
dipole: 0.8642422 0.5410355 -0.1085996 debye
dipolederiv: -0.5348358 -0.0483966 -0.0171402 -0.0328148 -0.618283 -0.0261622 0.0514601 -0.0248634 -0.469988 -0.7705421 -0.2367573 0.4628131 -0.192593 -0.5050472 0.2813043 0.414522 0.2685032 -0.6802302 -0.3326081 0.1092169 -0.0305 0.0745638 -1.0583334 0.3143983 -0.0335583 0.3445507 -0.539934 -0.5471558 -0.2605561 -0.0989328 -0.1540996 -0.4543744 -0.1835171 0.099218 -0.1408824 -0.8838251 -0.9826521 -0.2103131 0.1894792 -0.0020402 -0.5949178 0.1349183 0.0417713 0.1588562 -0.3972481 -0.0871952 -0.0910889 -0.0153419 -0.1705918 -0.3216732 -0.0833796 -0.1435055 -0.1391887 -0.1228709 -0.3267317 0.1042342 -0.0060186 0.0563984 -0.1331727 0.0024477 -0.2020242 0.079732 0.0338195 0.2668707 -0.0364268 -0.016723 0.109635 0.6296105 0.069861 -0.0088695 0.0416641 0.3750684 0.2791032 -0.0310021 -0.0444141 -0.0866108 0.4507153 0.0295909 -0.0377674 0.0027005 0.3019553 -0.0360173 0.0254929 0.0338891 0.0256384 -0.2324059 -0.0698476 0.0558907 -0.1483487 -0.1259735 -0.0288258 -0.0790764 -0.002102 -0.0189175 -0.2395017 -0.0551288 0.0117858 -0.0838925 -0.011029 1.0491016 0.7813095 -0.2432766 0.5622175 0.6515493 0.0102973 -0.2813145 0.1028894 1.2835532 1.4121402 -0.0275253 -0.1194617 -0.0703556 1.1853642 -0.488744 0.0698417 -0.5645579 0.4645284 0.0935647 -0.0094276 -0.0411378 -0.0194946 0.0409133 0.052223 -0.0180726 0.0426107 0.0448324 0.1097244 0.0426722 -0.0264822 0.0579364 0.0888981 -0.03706 0.0489832 -0.0252079 0.0219675 0.040356 0.0081546 0.0481015 0.008494 0.0425836 0.0055614 0.0764609 0.0060346 -0.0496614 -0.0019081 -0.0618259 0.0417336 -0.0460278 0.0646976 0.0159032 0.0137812 0.0040398 0.0707347 -0.0482464 0.0276907 -0.0311742 -0.0050751 0.1785083 0.0242345 -0.033724 0.0619238 0.1044425 0.0906772 0.0299394 -0.0181141 0.0046868 0.1651519 0.0630831 -0.031126 0.1000638 -0.0136444 0.279829 -0.072924 -0.0662928 -0.0787393 0.3107931 -0.0762074 -0.1110578 -0.1151113 0.2237316 0.0753515 0.0366097 0.0010952 -0.02221 0.3489241 0.0162235 0.0173049 0.028484 0.3697711 unknown
polarizability: 105.1021293|4.3097586|88.7083135|-6.3994215|-8.3423709|81.0867597 unknown
InChI: InChI=1S/C8H8O5/c9-7(10)5-3-1-2-4(13-3)6(5)8(11)12/h1-6,9,11H
charge 0 multiplicity 1
21 atoms
O  -0.366263 -1.687196 -1.033181
O  2.379008 1.770356 -0.94716
O  -2.052707 1.84364 -0.468493
O  1.657501 1.673828 1.258179
O  -3.161364 0.069627 0.531541
C  0.413842 0.47209 -0.518175
C  -0.696182 0.080377 0.505244
C  0.936782 -0.968026 -0.982513
C  -0.669222 -1.500922 0.424528
C  1.629557 -1.629099 0.214994
C  0.634163 -1.95873 1.082569
C  1.498546 1.351446 0.060694
C  -2.086018 0.612883 0.199989
H  -0.01032 0.973712 -1.401584
H  -0.426269 0.436929 1.518408
H  1.431925 -0.984603 -1.959578
H  -1.610099 -1.996216 0.687849
H  2.708341 -1.729016 0.34298
H  0.714693 -2.384415 2.083793
H  3.088387 2.343768 -0.547917
H  -2.984902 2.167167 -0.603966
