program: Gaussian 09
title: 000092239
version: EM64L-G09RevD.01
frameworkgroup: C1[X(C11H24)]
method: RPBEPBE
basis: SDD
operation: Freq
keyword: #p
keyword: freq=noraman
keyword: PBEPBE/SDD
title: #p freq=noraman PBEPBE/SDD
converged: YES YES NO NO
title: Mulliken charges:
elementType: C C C C C C C C C C C H H H H H H H H H H H H H H H H H H H H H H H H
charge: 0.017339 -0.399950 -0.394354 -0.374742 -0.374684 -0.375570 -0.353219 -0.747848 -0.356607 -0.710918 -0.696665 0.178910 0.187013 0.188945 0.189797 0.196996 0.190982 0.189611 0.189555 0.188462 0.204466 0.188337 0.187567 0.187737 0.212492 0.218429 0.205630 0.194878 0.194618 0.216418 0.208477 0.213828 0.209664 0.214787 0.209618
chargesum: 0.00000
title: Mulliken charges with hydrogens summed into heavy atoms:
elementType: C C C C C C C C C C C
charge: 0.196248 -0.023993 -0.007561 0.005851 0.003334 0.017233 0.022086 -0.111296 0.032889 -0.072196 -0.062595
polarizability: 1.50612721e+02 4.09014422e-01 1.10801527e+02 -5.74400910e-01 -7.37317498e-01 1.01470757e+02
1716.lowfreq: -26.2750 -0.0004 0.0004 0.0006 3.7689 11.1238 36.0777 42.6469 49.4720
frequency: 31.1521 42.5403 48.8569 68.7514 86.9368 97.4051 140.9080 144.1575 152.4673 201.1782 213.5405 231.9922 235.1491 256.6745 292.0683 369.5655 394.6906 418.5290 490.5341 501.1377 719.3096 725.3672 747.7485 762.7820 794.0955 829.9188 888.1612 896.9604 913.9353 959.1159 975.4544 984.9587 1003.7560 1020.5425 1040.7976 1048.6095 1055.2227 1078.2917 1079.2022 1105.8640 1143.8188 1152.0109 1176.3183 1193.5660 1219.9324 1231.5159 1260.4354 1261.1515 1277.3374 1281.1992 1290.4679 1293.5055 1300.7208 1310.8081 1328.2226 1341.5940 1349.1754 1354.2891 1358.4839 1381.8579 1389.6614 1389.7857 1455.5738 1460.6380 1462.9049 1466.2022 1468.2036 1473.8153 1474.8736 1477.7515 1478.0527 1483.4549 1484.3347 1488.2879 1491.5264 2940.1199 2947.1407 2949.6366 2950.0837 2955.2372 2961.8737 2963.4606 2967.6570 2968.9033 2971.1796 2974.2915 2982.8746 2989.4248 2997.4982 3011.6475 3021.2502 3027.8635 3040.0965 3059.7277 3066.1891 3067.9087 3069.8538 3070.5050 3077.0426
redmass: 2.6124 1.9651 2.3478 2.1994 2.4462 1.8655 2.3433 1.8926 2.3050 1.0846 2.9767 1.4313 1.1277 2.5804 2.0424 2.3715 2.8623 2.4349 2.7824 2.6274 1.0808 1.1043 1.3011 1.2614 1.4323 1.3302 1.8555 1.4003 1.5170 1.2077 2.1693 1.2232 3.1308 2.6614 1.4878 2.1447 2.7002 2.2873 2.2684 1.9735 2.5029 1.9899 2.0245 1.6698 1.3119 1.3805 1.2636 1.2913 1.1953 1.0677 1.1764 1.0977 1.2027 1.2448 1.4069 1.5387 1.5169 1.6821 1.5453 1.2255 1.2079 1.2142 1.0741 1.0748 1.0711 1.0661 1.0784 1.0475 1.0703 1.0681 1.0444 1.0841 1.0543 1.0912 1.0498 1.0772 1.0625 1.0589 1.0592 1.0597 1.0603 1.0601 1.0575 1.0393 1.0367 1.0370 1.0962 1.0976 1.1010 1.1033 1.0979 1.1041 1.1044 1.0984 1.0991 1.1007 1.0993 1.0996 1.0985
irintensity: 0.0054 0.0025 0.0022 0.0197 0.0006 0.0061 0.0024 0.0018 0.0043 0.0136 0.0097 0.0240 0.0028 0.1375 0.0500 0.1626 0.3231 0.3751 0.5995 0.3623 11.8864 2.5744 2.1482 6.8424 1.2197 0.5753 5.0646 2.3004 2.4039 5.1673 4.5583 1.8317 2.0422 1.8010 1.0828 5.8023 0.1980 0.6740 0.1821 14.4610 0.9250 4.6214 0.2521 0.3737 5.4058 1.4624 0.6417 0.1976 0.7353 0.5019 0.0544 0.7822 0.1827 0.0379 0.6040 2.1431 2.2585 0.2574 1.4289 15.4505 22.6962 1.8410 0.6977 0.2277 0.0060 2.3200 0.3184 12.5848 4.8519 2.3583 11.4925 4.5650 19.6108 25.7382 4.6131 3.8166 10.6990 1.4389 0.7693 1.3659 33.5369 55.5884 129.9348 88.5154 37.4497 30.1666 0.6409 3.5601 4.0353 4.8668 27.2338 0.4212 175.1494 43.0600 71.4703 103.4210 49.5423 66.2174 54.2439
temp: 298.150 k
press: 1.00000 atm
elementType: 6 6 6 6 6 6 6 6 6 6 6 1 1 1 1 1 1 1 1 1 1 1 1 1 1 1 1 1 1 1 1 1 1 1 1
symmnumber: 1
zpe: 852526.3 jmol-1
zpe.correction: 0.324710 hartree
zpe.thermalcorrener: 0.340193 hartree
zpe.thermalcorrenthalpy: 0.341137 hartree
zpe.thermalcorrgfe: 0.280714 hartree
zpe.sumelectzpe: -432.623231 hartree
zpe.sumelectthermal: -432.607749 hartree
zpe.sumelectthermalent: -432.606805 hartree
zpe.sumelectthermalfe: -432.667228 hartree
dipole: -0.0670 0.0489 -0.0438
dipole: 0.0938
quadrupole: -76.2743 -74.0849 -72.9518
quadrupole: -0.0043 0.3267 0.7153
quadrupole: -1.8373 0.3521 1.4852 -0.0043 0.3267 0.7153
hfenergy: -432.9479415 hartree
pointgroup: C01 [X(C11H24)]
dipole: -0.026274 -0.0198073 0.0167001 debye
polarizability: 150.6163189|-0.4937503|110.8432091|0.2542749|-0.405921|101.4254764 unknown
InChI: InChI=1S/C11H24/c1-4-6-7-8-9-10-11(3)5-2/h11H,4-10H2,1-3H3
charge 0 multiplicity 1
35 atoms
C  3.031418 0.346425 0.26921
C  1.629366 0.881671 -0.138877
C  0.438168 -0.009187 0.284014
C  -0.930002 0.569555 -0.143469
C  -2.1282 -0.304337 0.291197
C  3.414222 -0.922178 -0.542638
C  -3.49413 0.256504 -0.164861
C  4.091966 1.463139 0.112922
C  -4.692825 -0.614269 0.276332
C  4.706139 -1.624386 -0.067636
C  -6.052578 -0.05146 -0.191377
H  2.987038 0.059837 1.343637
H  1.608483 1.026548 -1.240677
H  1.487734 1.888608 0.306932
H  0.453818 -0.137846 1.386877
H  0.546497 -1.02425 -0.148929
H  -0.945916 0.689864 -1.247193
H  -1.046988 1.589174 0.280453
H  -2.124673 -0.407368 1.396718
H  -1.999843 -1.329503 -0.115788
H  2.580016 -1.649139 -0.492339
H  3.516713 -0.638648 -1.611545
H  -3.500239 0.352483 -1.271033
H  -3.62265 1.284074 0.235775
H  3.820951 2.352803 0.711843
H  5.093871 1.132369 0.440316
H  4.168641 1.780498 -0.94571
H  -4.689142 -0.704689 1.381932
H  -4.560711 -1.642164 -0.1193
H  5.595848 -0.982253 -0.198823
H  4.638641 -1.891258 1.004503
H  4.883408 -2.556644 -0.635378
H  -6.09369 0.018543 -1.294937
H  -6.892295 -0.69084 0.138238
H  -6.221355 0.964123 0.214308
