program: Gaussian 09
title: 000092223
version: EM64L-G09RevD.01
frameworkgroup: C1[X(C9H10N2O)]
method: RPBEPBE
basis: SDD
operation: Freq
keyword: #p
keyword: freq=noraman
keyword: PBEPBE/SDD
title: #p freq=noraman PBEPBE/SDD
converged: YES YES NO NO
title: Mulliken charges:
elementType: O N N C C C C C C C C C H H H H H H H H H H
charge: -0.239938 -0.404817 0.001389 -0.199474 -0.464782 -0.511337 0.488801 0.151624 -0.360932 -0.478072 -0.179263 -0.337451 0.237172 0.234680 0.248385 0.247496 0.255003 0.319833 0.242648 0.269054 0.233758 0.246224
chargesum: 0.00000
title: Mulliken charges with hydrogens summed into heavy atoms:
elementType: O N N C C C C C C C C C
charge: -0.239938 -0.084984 0.001389 0.037698 0.018284 -0.008839 0.488801 0.151624 -0.118285 -0.209018 0.054495 -0.091227
polarizability: 1.53197976e+02 4.74193337e+00 9.54846431e+01 -3.92717466e+00 -8.24656605e+00 7.20174874e+01
1716.lowfreq: -12.0004 -8.1706 -0.0009 -0.0007 0.0001 3.4432 40.4800 70.5120 96.0925
frequency: 40.4193 70.4997 96.0688 155.7657 224.1089 269.6164 311.0794 396.9132 444.7899 507.7173 532.4251 581.2290 604.8273 623.5972 656.4860 675.9583 725.5524 806.2440 812.8678 827.3451 886.1398 922.0573 931.9568 950.5261 987.7251 998.7392 1005.6421 1030.1145 1036.8073 1080.7645 1115.8613 1139.9536 1193.4143 1196.9745 1221.8258 1243.8398 1270.2157 1290.6746 1295.7184 1308.8363 1323.9735 1356.9607 1381.1533 1422.9179 1452.4036 1456.3595 1476.7744 1560.0965 1587.1549 1669.6738 2935.8048 3013.4353 3024.8097 3087.5359 3100.7615 3122.3860 3126.7334 3136.3276 3166.8456 3564.2598
redmass: 4.2846 5.4477 3.7053 2.3433 4.9154 3.6529 5.6359 3.1812 5.2132 1.6994 3.6905 3.3736 3.7167 2.6643 3.6825 3.3580 1.8980 1.9472 3.7374 1.9447 3.1782 2.2525 1.3537 1.5090 1.4182 2.2730 3.3769 2.7941 2.1044 2.8210 1.6963 1.3937 1.4904 1.3231 1.8538 2.0410 1.3786 1.8453 1.3730 2.9093 1.6732 1.3869 1.8745 1.9543 1.0934 2.1504 1.0978 5.4685 5.8578 8.7289 1.0848 1.0645 1.0627 1.0998 1.1023 1.0892 1.0912 1.0910 1.0995 1.0786
irintensity: 0.6234 1.4890 0.5590 0.8226 0.0303 2.4527 0.7173 4.9585 8.1432 21.4600 2.5143 24.2773 31.8663 32.6289 39.5924 20.6386 35.1032 28.4002 1.5735 21.9279 2.7215 1.6065 0.6643 3.1350 0.6609 3.9313 9.3959 0.0914 10.7839 11.3985 4.7871 29.0192 13.0431 4.8198 4.3700 125.3272 7.1454 13.8922 13.0491 17.4356 5.1822 4.0539 35.3289 31.3938 4.4963 19.9122 9.7496 9.6757 0.6204 478.5356 44.2715 19.0559 17.9490 10.8001 22.0765 7.0359 18.3164 12.7532 26.0905 24.4461
temp: 298.150 k
press: 1.00000 atm
elementType: 8 7 7 6 6 6 6 6 6 6 6 6 1 1 1 1 1 1 1 1 1 1
symmnumber: 1
zpe: 463180.1 jmol-1
zpe.correction: 0.176416 hartree
zpe.thermalcorrener: 0.186334 hartree
zpe.thermalcorrenthalpy: 0.187279 hartree
zpe.thermalcorrgfe: 0.139904 hartree
zpe.sumelectzpe: -532.823244 hartree
zpe.sumelectthermal: -532.813325 hartree
zpe.sumelectthermalent: -532.812381 hartree
zpe.sumelectthermalfe: -532.859756 hartree
dipole: 2.9553 4.7390 -0.7322
dipole: 5.6327
quadrupole: -82.7694 -72.5075 -68.9605
quadrupole: -3.5522 -7.3738 0.0411
quadrupole: -8.0236 2.2383 5.7853 -3.5522 -7.3738 0.0411
hfenergy: -532.9996596 hartree
pointgroup: C01 [X(C9H10N2O1)]
dipole: 1.1540664 -1.8588281 0.3519711 debye
dipolederiv: -1.1509151 0.309728 0.0171581 0.5727242 -0.7182452 -0.1198847 0.1134335 -0.1640893 -0.4531731 -1.4132656 0.1942994 -0.0638842 -0.1112016 -0.4083126 0.0255803 -0.1897198 0.0680307 -0.4187277 -0.3428269 -0.0086231 0.000951 -0.0135769 -0.2901202 0.0277263 0.0314011 0.0236414 -0.2568708 0.4622497 -0.105869 -0.090176 -0.2948634 0.4271059 -0.0693704 -0.3771975 -0.0483054 0.2661413 -0.0211815 -0.0655684 -0.0500763 0.0776842 0.1291436 -0.047107 0.0912812 -0.0042145 0.0364165 -0.0188288 0.0164483 -0.0262685 0.0367286 -0.1941621 -0.2539282 -0.0740309 -0.2601017 -0.0399879 0.2174666 0.0830493 0.0331727 0.194289 -0.1655591 0.0841952 -0.0302205 0.0788104 -0.0703092 1.8762191 -0.4771098 0.1851085 -0.4428394 0.7630046 0.3365803 0.3876738 0.2799599 0.4887768 -0.018727 0.0004395 -0.0163094 0.0012675 0.0813867 -0.1271515 0.0055606 -0.1138023 -0.0579017 0.0721138 -0.0245485 -0.0019564 -0.2124649 0.1253377 -0.1256306 0.0968662 -0.1164095 0.0028853 -0.0729779 -0.0805231 0.0501246 -0.2126618 -0.0851483 -0.0080442 0.1273277 -0.0044757 -0.0922913 0.2731798 0.0124411 -0.0194032 0.1738116 0.0819207 -0.1010675 -0.1177815 -0.0972235 -0.0244942 -0.0416501 0.0430758 -0.0118065 0.0762364 -0.1147061 0.1061806 0.024509 0.1019872 -0.0771454 0.0464805 0.065124 0.009848 0.0340991 -0.1301622 -0.0582745 -0.0027594 -0.0116194 0.077322 0.0219644 -0.0261302 0.0677157 -0.0355137 0.0354965 0.0972468 0.0921473 0.0425348 -0.0368647 -0.0060016 -0.0451607 0.049341 -0.0864603 -0.0126048 0.0384179 0.081717 0.0662548 0.0477732 -0.0042434 0.0201166 -0.059854 0.0471642 0.0944781 0.0506125 -0.0836854 0.0166606 -0.0365029 0.1967588 0.0358358 -0.0543659 0.0867557 0.1906922 -0.0782942 -0.1106845 -0.0775592 0.2250634 0.0952915 -0.0617957 0.0439152 -0.0390682 -0.0212823 0.0954397 0.0257607 0.0959014 0.0774091 -0.0107523 0.065479 -0.0370228 0.1042876 0.0693365 0.0329402 -0.0675444 0.0320383 0.0974791 -0.0438657 0.0796231 -0.0473112 0.0987933 0.050297 0.0640407 -0.0571163 0.0649358 0.1205237 -0.1164881 -0.0303314 0.0210993 -0.0551913 0.0921035 0.0297922 0.0330622 0.0270453 0.1244786 unknown
polarizability: 153.2000674|-5.0224371|94.8563347|3.3892084|-9.1314964|72.6437041 unknown
InChI: InChI=1S/C9H10N2O/c12-9-4-3-8(11-9)7-2-1-5-10-6-7/h1-2,5-6,8,11H,3-4H2
charge 0 multiplicity 1
22 atoms
O  -3.738766 1.197059 0.464167
N  -1.530444 0.429206 0.789324
N  2.428494 1.30785 -0.737631
C  -0.643639 -0.690536 0.41681
C  -1.342687 -1.227574 -0.884824
C  -2.827991 -0.821556 -0.727168
C  0.806408 -0.277781 0.210356
C  -2.800849 0.393976 0.219157
C  1.868923 -1.086065 0.680605
C  1.146533 0.911659 -0.487722
C  3.203158 -0.695886 0.429914
C  3.435411 0.502106 -0.283138
H  -0.67374 -1.478974 1.20025
H  -1.189249 -2.312865 -0.999619
H  -0.89812 -0.726248 -1.762168
H  -3.433682 -1.615179 -0.250538
H  -3.321396 -0.55273 -1.674543
H  -1.296553 1.099896 1.523111
H  1.654072 -2.007224 1.23632
H  0.359694 1.582463 -0.853492
H  4.045613 -1.2998 0.781018
H  4.454211 0.841703 -0.501287
