program: Gaussian 09
title: 000092224
version: EM64L-G09RevD.01
frameworkgroup: C1[X(C11H13NO)]
method: RPBEPBE
basis: SDD
operation: Freq
keyword: #p
keyword: freq=noraman
keyword: PBEPBE/SDD
title: #p freq=noraman PBEPBE/SDD
converged: YES YES NO NO
title: Mulliken charges:
elementType: O N C C C C C C C C C C C H H H H H H H H H H H H H
charge: -0.231041 -0.147110 0.407736 -0.348505 -0.362034 0.524237 -0.400110 -0.416254 -0.646047 -0.644548 -0.308638 -0.245131 -0.134706 0.240298 0.240457 0.229127 0.227410 0.240185 0.220969 0.239710 0.239189 0.239542 0.220909 0.219493 0.246553 0.148310
chargesum: 0.00000
title: Mulliken charges with hydrogens summed into heavy atoms:
elementType: O N C C C C C C C C C C C
charge: -0.231041 -0.147110 0.407736 -0.108207 -0.121577 0.524237 -0.170983 -0.188844 0.054816 0.055092 -0.089145 0.001422 0.013604
polarizability: 3.29504814e+02 6.04389131e+00 1.22111129e+02 -1.93121033e-02 -1.02073071e-01 6.14022520e+01
1716.lowfreq: -7.4095 -1.3409 -0.0005 -0.0002 0.0005 4.9371 42.9797 70.1095 83.4065
frequency: 42.9600 69.7068 83.4058 105.1899 129.9054 141.3631 197.4744 198.4623 216.2574 259.5168 286.4786 326.0888 406.4452 420.9295 431.9782 472.7086 525.1038 546.5385 571.4288 636.2340 717.6108 740.1112 805.6741 821.9726 840.7419 868.9901 941.8341 948.1653 961.0982 963.1592 994.5916 1001.4978 1054.2158 1104.4509 1111.1550 1128.2841 1151.6556 1166.3223 1201.7385 1227.3852 1257.2573 1275.9144 1292.3191 1333.3586 1370.6546 1372.4809 1389.6843 1429.5153 1452.9182 1458.6984 1464.8948 1477.4668 1492.1984 1505.2193 1530.0884 1548.8390 1587.3460 1617.1378 1640.7245 2838.5876 2948.0074 2955.2392 3016.8693 3020.1794 3064.6693 3100.8988 3111.5414 3120.7907 3132.4828 3139.4638 3168.6486 3172.4355
redmass: 4.9806 2.2547 6.0179 3.2762 1.4295 2.1821 1.2086 2.2235 3.7505 5.3534 2.8831 4.3281 3.2012 3.4706 3.0221 3.6808 2.1383 4.1059 3.9476 6.7215 4.8603 3.0798 1.2931 1.6631 5.3534 1.6930 3.1016 1.3707 1.5949 1.3941 2.9058 1.2492 1.5094 1.2371 1.3283 1.9489 2.2842 1.7104 1.1776 1.2281 2.8266 2.1574 1.6844 1.3668 2.8901 2.0201 2.0239 1.2086 2.3650 1.3707 1.0403 1.0457 1.1202 1.1374 2.6608 6.0065 6.2427 5.2178 5.8818 1.0838 1.0366 1.0391 1.0998 1.1026 1.0882 1.0968 1.0947 1.0895 1.0913 1.0884 1.0933 1.0940
irintensity: 0.0872 0.4821 2.5337 12.2786 0.0930 0.2441 0.1412 0.4055 3.8964 1.6649 10.5553 6.2787 0.0058 0.1079 0.0137 2.6909 15.9171 16.7865 16.4106 0.6533 9.7089 0.3690 6.1675 81.8746 0.4095 0.0018 25.4278 8.2403 3.7578 0.4369 0.1004 50.7547 25.7505 0.0204 0.9998 63.3695 251.4355 0.0186 64.7431 36.5742 26.1781 23.9531 5.2871 26.9720 140.1304 177.9635 4.3114 9.1374 24.4010 6.4853 0.0544 23.9365 1.8534 62.9912 202.1033 4.6433 603.0589 781.1132 31.4792 163.8482 93.1382 131.6670 8.7779 69.2785 18.9000 4.3601 42.1159 10.5005 9.9296 6.1872 22.9198 12.5828
temp: 298.150 k
press: 1.00000 atm
elementType: 8 7 6 6 6 6 6 6 6 6 6 6 6 1 1 1 1 1 1 1 1 1 1 1 1 1
symmnumber: 1
zpe: 556893.7 jmol-1
zpe.correction: 0.212110 hartree
zpe.thermalcorrener: 0.225242 hartree
zpe.thermalcorrenthalpy: 0.226186 hartree
zpe.thermalcorrgfe: 0.171963 hartree
zpe.sumelectzpe: -555.963856 hartree
zpe.sumelectthermal: -555.950724 hartree
zpe.sumelectthermalent: -555.949780 hartree
zpe.sumelectthermalfe: -556.004003 hartree
dipole: 9.9135 1.2872 -0.0002
dipole: 9.9968
quadrupole: -97.4354 -68.1273 -82.3132
quadrupole: -10.6256 0.0460 -0.0091
quadrupole: -14.8101 14.4980 0.3121 -10.6256 0.0460 -0.0091
hfenergy: -556.1759659 hartree
pointgroup: C01 [X(C11H13N1O1)]
dipole: 3.9061161 -0.4592011 0.0104307 debye
dipolederiv: -1.7418846 0.1602216 -0.0042568 0.6471374 -0.5410397 -0.0011591 0.0105892 -0.0044084 -0.3620604 -2.2079474 -0.1358292 -0.0169224 -0.2540624 -0.510924 -0.0081575 -0.0285056 -0.0115785 -0.2787905 2.0035056 0.2176873 0.0199542 0.3072855 -0.0223153 -0.0047156 0.0246965 -0.0042335 0.1319227 -0.8616052 -0.0979455 -0.0074495 0.4732811 0.053096 0.0116563 0.0130956 0.0079126 -0.222487 -0.7223086 -0.0194606 -0.0034992 -0.7416394 -0.0496815 0.0007239 -0.0280032 0.004552 -0.2275635 -1.2660305 -0.0406165 -0.0096888 -0.2883899 -0.2664058 -0.0105916 -0.0175138 -0.0084293 0.0062015 0.5514725 0.1267366 0.0087949 0.412204 0.1688515 0.011905 0.0172811 0.0099612 -0.1217437 0.7823319 -0.0748426 0.0037124 -0.2541368 0.1619666 0.0081599 -0.0014511 0.0093982 -0.1558093 0.3001874 0.1255752 0.0047829 0.572671 0.5078219 0.0100746 0.0227152 0.0075104 0.2476168 0.5139887 -0.1698695 -0.0042626 -0.5739274 0.3616805 -0.0000261 -0.0181892 0.0025907 0.2475661 1.8625238 0.0129755 0.0135196 -0.2586271 0.1719312 0.0072313 0.0050646 0.0089704 -0.1202628 -1.9400738 0.0805592 -0.009131 0.0802678 0.0111231 0.0067343 -0.0086645 0.0067153 -0.1915252 2.5065332 -0.1898972 0.0102756 0.1803559 0.7136998 0.0204167 0.0215908 0.0180216 0.0845401 0.032091 -0.0735058 -0.0030976 -0.0841335 -0.0678878 -0.0076356 -0.0031885 -0.0073821 0.1622257 -0.0184379 0.1020785 0.0017321 0.1020134 -0.0204225 -0.0050974 0.0014013 -0.0046213 0.1666283 0.0260823 0.1036113 0.0024373 0.0624656 -0.0175748 -0.0044576 0.0006034 -0.004363 0.1401234 0.0567797 -0.0930612 -0.0034957 -0.0519243 -0.0778693 -0.0073397 -0.001733 -0.0077046 0.1478749 0.1062072 0.0705513 0.0865559 -0.135499 -0.0633249 -0.077953 -0.026316 -0.1187583 -0.0848259 -0.1948647 -0.0302131 -0.0052321 0.0577274 0.0983506 0.0007529 -0.0019768 -0.0000671 0.1186075 0.1065808 0.0713349 -0.07677 -0.1438884 -0.0785109 0.0773357 0.022741 0.1231473 -0.0755005 0.0711126 -0.0317488 0.0544526 0.1869189 -0.0644079 0.1000428 -0.0532153 0.1196316 -0.0740738 0.0717186 -0.0286027 -0.0572404 0.1814585 -0.0485493 -0.0958962 0.066762 -0.1171135 -0.0882002 -0.1645855 -0.0382923 -0.0017303 -0.1362167 0.0699116 -0.0015705 -0.0051301 -0.0012075 0.1184476 0.0451626 -0.0355714 -0.001731 -0.0799088 -0.1043922 -0.0082891 -0.0032956 -0.0080185 0.1485252 0.0340184 -0.0531238 -0.0025555 -0.0705134 -0.0756415 -0.0080532 -0.0031178 -0.0079502 0.1724635 0.0474419 0.0412489 0.0008454 -0.1909196 -0.3094855 -0.0140911 -0.0062404 -0.0125756 0.1100997 unknown
polarizability: 329.6100073|-3.5579578|121.9359531|1.65801|1.8815439|61.4722347 unknown
InChI: InChI=1S/C11H13NO/c1-12(2)11-7-5-10(6-8-11)4-3-9-13/h3-9H,1-2H3
charge 0 multiplicity 1
26 atoms
O  -5.663864 0.59279 -0.023037
N  3.444184 0.250425 0.028692
C  2.066592 0.044532 0.01227
C  1.148207 1.149672 0.040628
C  1.510341 -1.276716 -0.03317
C  -0.794948 -0.374138 -0.020485
C  -0.234611 0.939208 0.02439
C  0.122463 -1.46675 -0.0485
C  3.98897 1.615292 0.080424
C  4.361232 -0.897857 -0.012107
C  -2.227021 -0.637667 -0.037978
C  -3.262179 0.273829 -0.016753
C  -4.653215 -0.173207 -0.039704
H  1.524912 2.175483 0.074609
H  2.164998 -2.151818 -0.055045
H  -0.89918 1.81002 0.04682
H  -0.27284 -2.49009 -0.082852
H  3.65862 2.154016 0.990793
H  5.088831 1.569771 0.095337
H  3.684898 2.213287 -0.802034
H  4.221682 -1.56535 0.861876
H  4.220041 -1.50152 -0.93092
H  5.40117 -0.536922 -0.000017
H  -2.51029 -1.702959 -0.072498
H  -3.09513 1.357179 0.017419
H  -4.784964 -1.287911 -0.074656
