program: Gaussian 09
title: 000092238
version: EM64L-G09RevD.01
frameworkgroup: C1[X(C11H14N2O2)]
method: RPBEPBE
basis: SDD
operation: Freq
keyword: #p
keyword: freq=noraman
keyword: PBEPBE/SDD
title: #p freq=noraman PBEPBE/SDD
converged: YES YES NO NO
title: Mulliken charges:
elementType: O O N N C C C C C C C C C C C H H H H H H H H H H H H H H
charge: -0.441763 -0.286754 -0.106018 -0.361464 0.109409 -0.475182 0.189207 -0.370464 -0.700820 0.478606 -0.366014 -0.400858 -0.221997 -0.211038 -0.263166 0.246482 0.234526 0.212763 0.191319 0.257656 0.214508 0.227175 0.340067 0.243504 0.203643 0.371060 0.226284 0.227132 0.232196
chargesum: 0.00000
title: Mulliken charges with hydrogens summed into heavy atoms:
elementType: O O N N C C C C C C C C C C C
charge: -0.070703 -0.286754 -0.106018 -0.021396 0.109409 0.005826 0.189207 0.033618 -0.001481 0.478606 -0.122510 -0.197215 0.004287 0.016094 -0.030970
polarizability: 2.16899897e+02 -4.43281082e+00 1.31849289e+02 -5.62497613e+00 2.50394318e+00 8.01051691e+01
1716.lowfreq: -8.3075 -0.0003 -0.0003 0.0008 3.5825 5.8323 30.0397 51.8350 102.8653
frequency: 29.9293 51.8035 102.8492 116.3491 160.3018 184.5099 191.0949 203.3666 243.1451 261.2089 287.8670 307.3704 346.4741 379.5673 405.3728 439.3123 458.2762 502.3514 543.5758 598.9672 613.1990 643.4743 660.2016 687.4985 693.1017 718.0880 751.5844 806.6267 814.6158 868.6183 883.0418 943.8038 956.3251 963.6769 966.1778 978.6958 980.8774 991.0344 1000.9491 1031.0367 1083.4608 1126.4151 1135.5665 1155.2687 1174.9710 1182.5463 1199.9555 1217.2181 1246.4617 1289.4344 1302.5624 1328.2514 1333.9695 1345.2892 1380.1501 1382.6793 1406.1965 1410.4645 1448.9511 1461.6844 1473.9060 1474.4710 1480.3036 1497.7318 1582.9673 1617.2851 1640.1402 2915.7258 2935.2188 2986.4183 3048.4572 3071.1575 3080.9032 3108.4965 3123.9255 3133.2235 3146.0646 3159.5711 3172.9057 3391.6027 3597.9857
redmass: 4.3442 4.3247 5.2783 4.1212 2.7254 3.1751 4.1436 1.1887 3.6365 5.0198 3.5462 4.3465 2.2774 3.5564 2.8266 4.5436 1.5271 2.6409 3.5061 1.2790 5.0129 7.3652 3.1442 1.9355 5.8175 4.0671 1.8523 1.2816 5.1951 1.4712 2.2338 1.7709 1.3856 2.9183 1.6268 2.2609 2.0191 1.7020 5.3564 2.0572 2.0255 1.7007 2.7167 2.0664 1.0528 1.9449 1.1380 1.8309 1.8742 2.1869 2.0506 1.4255 1.2785 1.4924 1.2505 4.2896 1.4387 2.1422 2.4908 1.0634 1.0715 1.0873 1.0879 2.6541 6.1599 6.2308 7.2372 1.0698 1.0681 1.0359 1.0953 1.0935 1.0999 1.0996 1.0860 1.0866 1.0930 1.0940 1.1010 1.0662 1.0803
irintensity: 0.8936 1.2649 1.8031 1.8436 8.4272 1.2417 4.1075 3.3626 8.2258 6.9632 5.1214 10.9549 10.7183 11.3983 2.5596 6.0842 105.0953 14.2435 14.2564 137.6882 16.6140 25.1876 50.9612 39.9003 21.0181 3.9917 103.1278 0.4521 2.7790 8.6811 4.0467 7.2688 0.2027 7.5830 1.5190 3.2642 6.6532 32.8148 86.9783 11.2344 3.8644 12.8530 11.6019 40.3555 0.9608 43.7084 4.7327 7.6088 34.7264 146.1228 104.5607 1.6831 42.0240 9.1111 47.5884 21.1774 55.4462 24.4416 2.6488 9.8324 34.1251 7.8507 7.3716 138.1183 9.6692 298.6708 297.3249 30.3447 85.5073 19.8517 29.8091 14.1187 26.1260 9.3234 19.5413 1.0655 27.5214 29.7674 10.3921 68.9347 46.4448
temp: 298.150 k
press: 1.00000 atm
elementType: 8 8 7 7 6 6 6 6 6 6 6 6 6 6 6 1 1 1 1 1 1 1 1 1 1 1 1 1 1
symmnumber: 1
zpe: 616174.2 jmol-1
zpe.correction: 0.234688 hartree
zpe.thermalcorrener: 0.248704 hartree
zpe.thermalcorrenthalpy: 0.249648 hartree
zpe.thermalcorrgfe: 0.193707 hartree
zpe.sumelectzpe: -686.372078 hartree
zpe.sumelectthermal: -686.358062 hartree
zpe.sumelectthermalent: -686.357118 hartree
zpe.sumelectthermalfe: -686.413059 hartree
dipole: 4.4716 -1.5353 0.5782
dipole: 4.7631
quadrupole: -106.4496 -82.5775 -92.7072
quadrupole: 5.4348 -5.2486 1.2284
quadrupole: -12.5382 11.3340 1.2042 5.4348 -5.2486 1.2284
hfenergy: -686.606766 hartree
pointgroup: C01 [X(C11H14N2O2)]
dipole: 1.7657068 -0.5815689 0.2359889 debye
polarizability: 216.9594808|-3.685289|131.8461752|-5.8303011|1.4117903|80.0486992 unknown
InChI: InChI=1S/C11H14N2O2/c1-11(8-14)7-13(12-10(11)15)9-5-3-2-4-6-9/h2-6,12,14H,7-8H2,1H3
charge 0 multiplicity 1
29 atoms
O  -4.429653 -0.425217 -0.718685
O  -2.776684 1.8668 -0.335479
N  0.212206 0.04478 0.373519
N  -0.53926 1.223774 0.027479
C  -2.122335 -0.505656 0.228572
C  -0.695145 -1.099309 0.076277
C  -1.890248 0.996863 -0.061937
C  -3.126487 -1.068279 -0.818827
C  -2.670769 -0.665223 1.670282
C  1.599905 0.009804 0.125203
C  2.247692 -1.24477 -0.071648
C  2.39007 1.196769 0.134292
C  3.64402 -1.301395 -0.251847
C  3.784444 1.12182 -0.05939
C  4.426103 -0.12322 -0.253289
H  -0.508097 -1.917327 0.790074
H  -0.523915 -1.47376 -0.959099
H  -3.30475 -2.143216 -0.635353
H  -2.695527 -0.9493 -1.838487
H  -3.652054 -0.17122 1.759786
H  -2.805869 -1.737627 1.903542
H  -1.97735 -0.23022 2.412234
H  -0.077236 2.128456 -0.048992
H  1.666272 -2.171488 -0.082046
H  1.940015 2.178584 0.321697
H  -4.271664 0.562876 -0.739721
H  4.122213 -2.276097 -0.400644
H  4.373068 2.045973 -0.049508
H  5.509535 -0.173575 -0.399407
