program: Gaussian 09
title: 000092293
version: EM64L-G09RevD.01
frameworkgroup: C1[X(C18H34O2)]
method: RPBEPBE
basis: SDD
operation: Freq
keyword: #pfreq=noraman
keyword: PBEPBE/SDD
title: #p freq=noraman PBEPBE/SDD
converged: NO YES NO NO
title: Mulliken charges:
elementType: O O C C C C C C C C C C C C C C C C C C H H H H H H H H H H H H H H H H H H H H H H H H H H H H H H H H H H
charge: -0.265672 -0.249541 -0.380399 -0.388633 -0.409840 -0.388607 -0.366678 -0.409666 -0.394069 -0.406639 -0.481297 -0.273436 -0.161877 -0.402168 -0.226138 -0.346197 -0.351384 -0.695178 0.283521 -0.751508 0.187674 0.199982 0.215313 0.196430 0.194182 0.193999 0.196205 0.196819 0.185188 0.219419 0.205536 0.200827 0.201562 0.204207 0.214965 0.214127 0.203949 0.195627 0.228384 0.239600 0.233008 0.199643 0.198849 0.205263 0.197220 0.183672 0.188301 0.190136 0.227214 0.212212 0.197688 0.244966 0.244697 0.248544
chargesum: 0.00000
title: Mulliken charges with hydrogens summed into heavy atoms:
elementType: O O C C C C C C C C C C C C C C C C C C
charge: -0.265672 -0.249541 0.007258 0.023111 -0.021660 0.004417 0.037929 -0.003303 0.011700 0.022452 -0.081721 0.194547 0.071130 -0.003676 -0.020875 0.034696 0.027053 -0.058065 0.283521 -0.013302
polarizability: 2.18765925e+02 -8.16563250e+00 1.94527107e+02 6.69970870e+00 -4.20729361e+00 1.88088182e+02
1716.lowfreq: -12.6839 -11.2108 -4.0451 -0.0008 -0.0005 0.0005 9.2991 14.8699 22.6349
frequency: -11.4149 11.7919 22.1431 26.6875 32.3033 35.2231 49.5096 53.3211 64.0504 89.2307 98.9424 107.6338 115.6076 120.0290 132.5347 164.2372 179.4513 186.4438 207.4324 215.3816 224.1254 236.4061 245.2493 254.1517 278.7117 308.7498 326.9369 343.5908 349.4485 405.9126 431.2406 446.7557 502.7442 520.6083 565.8118 593.9672 609.3004 703.3569 712.0983 724.9062 746.7612 768.0899 789.2078 802.2380 819.7351 827.2787 843.9451 861.8412 888.7082 893.4033 903.5764 932.3764 935.0377 939.4890 950.2882 979.8966 991.1198 995.3014 1002.7838 1026.7806 1032.8779 1041.3287 1048.4990 1060.1496 1080.0604 1093.8307 1098.7462 1102.3439 1108.9856 1113.9087 1116.5852 1130.7517 1146.1585 1160.5171 1182.1885 1195.2720 1204.5275 1212.6611 1235.0439 1247.2170 1254.8999 1268.0019 1272.0636 1273.2254 1276.0681 1285.7805 1287.7284 1293.8490 1295.6422 1297.9975 1306.6089 1314.9904 1327.1598 1337.7471 1339.6290 1342.4440 1350.3472 1359.4319 1360.9298 1365.2184 1373.4696 1382.6625 1390.7751 1448.4640 1453.2643 1454.8379 1460.6226 1462.7725 1463.9554 1466.1624 1466.5416 1468.8391 1470.9381 1474.9690 1477.9124 1478.0867 1482.3475 1486.8077 1489.7371 1491.0698 1647.9667 1686.4898 2935.9225 2953.0671 2955.4075 2956.3936 2957.5257 2960.1659 2964.7063 2966.5536 2967.6808 2969.2013 2970.6071 2970.8007 2974.4155 2994.6427 2996.1654 3000.1250 3001.5281 3002.9388 3006.7821 3007.6182 3014.7130 3021.9281 3026.3992 3030.3472 3039.5065 3040.9698 3045.5593 3064.0466 3065.4415 3071.0084 3076.8890 3080.3827 3095.6384 3142.5405
redmass: 1.2384 5.7724 3.6010 6.1052 3.2932 4.0033 2.6300 3.0638 2.9487 1.8816 2.9749 3.7531 2.1470 2.2306 2.5119 1.9427 2.3901 2.5367 1.9336 2.5770 2.1719 2.3657 1.2694 2.2420 2.6782 4.0172 2.6511 2.7385 2.4201 2.5542 2.8263 2.5018 2.6261 2.3073 3.0008 3.5803 4.8391 1.1775 1.1505 1.1920 1.1969 1.2607 1.6565 1.4077 1.7488 2.2344 1.8973 2.3042 1.9296 2.2345 1.8897 2.2077 1.3195 2.6098 2.4977 1.0902 1.8228 1.8676 2.2460 1.9434 1.8537 1.6694 2.0709 2.2462 1.7253 1.8296 1.7008 1.9841 2.4693 2.0882 2.2916 2.2459 1.5888 1.4901 1.2714 1.3815 3.2034 1.4630 1.3346 1.3293 1.3827 1.2462 1.1561 1.2143 1.2328 1.1965 1.0929 1.1176 1.1839 1.1822 1.2975 1.2321 1.4558 1.4437 1.4413 1.4484 1.3718 1.4866 1.5683 1.6161 1.4131 1.3161 1.2218 1.0621 1.0520 1.0766 1.0757 1.0940 1.0783 1.0777 1.0713 1.0838 1.0886 1.0846 1.0705 1.0541 1.0860 1.0928 1.0862 1.0732 9.1512 6.1338 1.0599 1.0595 1.0595 1.0608 1.0589 1.0609 1.0611 1.0613 1.0614 1.0380 1.0745 1.0802 1.0625 1.0727 1.0824 1.0995 1.0817 1.0764 1.0986 1.0371 1.1005 1.0987 1.0991 1.1036 1.1023 1.1023 1.1014 1.0999 1.0914 1.1002 1.1069 1.0883 1.0972 1.1011
irintensity: 1.2631 0.2441 0.2342 1.3301 0.1360 0.2577 0.1185 0.0911 0.1113 0.0418 0.1802 1.6940 0.0386 0.1156 0.4218 0.1111 4.6379 5.2465 1.7941 1.2916 0.6748 1.5484 0.9586 0.0661 0.1963 9.3520 0.2118 1.5075 0.6999 0.3519 0.4020 0.6906 2.6918 1.4034 2.8920 0.4200 4.8769 12.8182 3.8962 13.7096 9.3402 1.5204 3.2327 1.3428 0.6138 12.7534 0.3380 2.9017 4.0202 2.0745 7.7218 9.0343 0.4602 14.2054 18.1235 44.7625 2.1575 9.9761 100.9807 3.6835 12.3316 10.1840 0.6645 1.8390 0.5569 1.2439 0.4154 1.9165 5.7109 1.0301 2.4488 3.7588 2.2421 2.1150 10.4036 1.4393 281.3831 13.7643 2.2573 4.2024 4.6042 1.2577 0.0817 1.0848 0.4467 3.1652 0.2754 1.6567 1.1712 0.8587 2.9430 1.7598 1.7305 0.8176 0.1854 0.1958 2.1827 5.3970 0.3965 1.6971 9.8681 33.7266 10.7997 40.7749 15.6412 8.3333 8.5644 14.0870 2.1925 7.9937 0.0594 2.7379 0.6605 2.2785 9.3365 8.4010 28.3455 7.8606 1.5099 16.0805 188.1319 1.7920 28.3242 23.8208 19.7338 4.5469 0.9269 21.7946 8.6265 93.5287 83.1782 26.1010 72.5593 52.6720 32.4209 8.7825 11.5292 0.6688 10.2935 34.1363 3.5726 5.6223 9.7551 58.2393 17.3411 56.8501 142.4495 151.9648 15.7373 77.9301 18.3094 61.4117 79.6243 51.5122 8.4175 11.0959
temp: 298.150 k
press: 1.00000 atm
elementType: 8 8 6 6 6 6 6 6 6 6 6 6 6 6 6 6 6 6 6 6 1 1 1 1 1 1 1 1 1 1 1 1 1 1 1 1 1 1 1 1 1 1 1 1 1 1 1 1 1 1 1 1 1 1
symmnumber: 1
zpe: 1269367.1 jmol-1
zpe.correction: 0.483476 hartree
zpe.thermalcorrener: 0.508411 hartree
zpe.thermalcorrenthalpy: 0.509355 hartree
zpe.thermalcorrgfe: 0.424492 hartree
zpe.sumelectzpe: -855.104986 hartree
zpe.sumelectthermal: -855.080051 hartree
zpe.sumelectthermalent: -855.079107 hartree
zpe.sumelectthermalfe: -855.163969 hartree
dipole: 0.0667 0.7380 -2.1616
dipole: 2.2851
quadrupole: -120.4768 -128.5835 -132.6055
quadrupole: -2.4606 0.8740 7.1768
quadrupole: 6.7452 -1.3616 -5.3836 -2.4606 0.8740 7.1768
hfenergy: -855.588462 hartree
pointgroup: C01 [X(C18H34O2)]
dipole: -0.0105684 0.3130704 0.8426867 debye
polarizability: 219.9413389|5.5989514|193.2733059|7.5184058|3.4531853|188.1665692 unknown
InChI: InChI=1S/C18H34O2/c1-3-4-5-6-7-8-9-10-11-12-13-14-15-16-17-20-18(2)19/h6-7H,3-5,8-17H2,1-2H3
charge 0 multiplicity 1
54 atoms
O  1.914019 -1.994286 -0.205759
O  1.774531 -2.793205 -2.391192
C  -3.907702 -0.732191 0.085591
C  -2.722087 -1.031252 1.031671
C  -4.367837 0.748743 0.089279
C  -2.371229 -2.535645 1.089218
C  -3.255898 1.783739 -0.220116
C  -1.132544 -2.87176 1.960144
C  -2.576689 1.60391 -1.596273
C  0.197995 -2.215822 1.504393
C  -1.464315 2.659534 -1.86606
C  0.576404 -2.601514 0.074056
C  -0.25327 2.488356 -0.969132
C  1.338514 3.250587 0.908227
C  0.152497 3.383498 -0.02994
C  2.231584 2.005214 0.720951
C  3.366185 1.931426 1.76836
C  4.307349 0.726206 1.553892
C  2.403124 -2.167853 -1.506969
C  3.752999 -1.501375 -1.663266
H  -4.768611 -1.372245 0.369813
H  -3.629769 -1.03602 -0.944336
H  -1.837641 -0.453733 0.697825
H  -2.960499 -0.669635 2.054216
H  -4.801166 0.984832 1.083416
H  -5.190343 0.867673 -0.646295
H  -3.243878 -3.091842 1.488497
H  -2.222188 -2.914139 0.056771
H  -3.696958 2.801361 -0.174398
H  -2.48295 1.753319 0.57191
H  -1.331203 -2.558236 3.004602
H  -0.999755 -3.973026 1.985684
H  -3.342576 1.670268 -2.396156
H  -2.131581 0.590979 -1.672317
H  1.011779 -2.531986 2.184472
H  0.133104 -1.11385 1.578353
H  -1.150254 2.576058 -2.927356
H  -1.886426 3.676243 -1.734972
H  0.655686 -3.697564 -0.054359
H  -0.137253 -2.220149 -0.677573
H  0.309672 1.551307 -1.102086
H  1.968559 4.161996 0.814303
H  0.962218 3.270802 1.955298
H  -0.432298 4.311576 0.084171
H  1.620137 1.082186 0.787588
H  2.668555 2.016699 -0.299459
H  3.953984 2.872183 1.740718
H  2.918142 1.87554 2.781803
H  3.738459 -0.22268 1.547929
H  5.074011 0.664369 2.348182
H  4.834657 0.806641 0.583689
H  4.128412 -1.663898 -2.683638
H  4.468899 -1.910795 -0.929847
H  3.665844 -0.419248 -1.463722
