program: Gaussian 09
title: 000092216
version: EM64L-G09RevD.01
frameworkgroup: C1[X(C3H4Br2O)]
method: RPBEPBE
basis: SDD
operation: Freq
keyword: #p
keyword: freq=noraman
keyword: PBEPBE/SDD
title: #p freq=noraman PBEPBE/SDD
converged: YES YES NO NO
title: Mulliken charges:
elementType: Br Br O C C C H H H H
charge: 0.035483 0.019993 -0.152977 -0.467328 -0.635688 0.025300 0.336976 0.307448 0.322447 0.208344
chargesum: 0.00000
title: Mulliken charges with hydrogens summed into heavy atoms:
elementType: Br Br O C C C
charge: 0.035483 0.019993 -0.152977 -0.130352 -0.005792 0.233645
polarizability: 1.09806763e+02 -1.01258288e+01 5.07139515e+01 4.47187780e+00 -8.98273621e-01 4.10806158e+01
1716.lowfreq: -10.7438 -4.2743 -0.0005 -0.0002 -0.0002 3.1386 76.1710 102.5566 150.6187
frequency: 76.1631 102.5525 150.6185 168.4639 246.5823 261.6231 518.4430 615.5131 640.8794 836.6347 914.8102 950.0803 1089.0525 1129.1306 1158.7958 1234.7592 1328.3628 1372.0098 1430.7504 1635.2098 2940.8118 3083.4175 3094.1348 3178.2117
redmass: 7.3990 7.8221 4.1611 12.4530 3.2315 3.5741 6.8472 4.6144 3.0084 3.2067 1.5454 1.7103 1.5700 1.1207 1.6300 1.1683 1.5620 1.1848 1.1206 8.2137 1.0882 1.0572 1.0865 1.1124
irintensity: 1.0158 6.1798 7.6400 1.3586 13.9752 13.8816 69.0504 1.7010 10.1683 27.9115 10.5692 5.2982 6.9030 10.1192 9.4479 18.0865 12.5304 2.6867 19.5379 110.2803 82.4074 2.4368 2.1276 0.1722
temp: 298.150 k
press: 1.00000 atm
elementType: 35 35 8 6 6 6 1 1 1 1
symmnumber: 1
zpe: 168416.3 jmol-1
zpe.correction: 0.064146 hartree
zpe.thermalcorrener: 0.071481 hartree
zpe.thermalcorrenthalpy: 0.072426 hartree
zpe.thermalcorrgfe: 0.029449 hartree
zpe.sumelectzpe: -218.369358 hartree
zpe.sumelectthermal: -218.362023 hartree
zpe.sumelectthermalent: -218.361079 hartree
zpe.sumelectthermalfe: -218.404056 hartree
dipole: 1.0259 -1.4875 -1.4615
dipole: 2.3241
quadrupole: -58.4307 -58.9576 -51.9697
quadrupole: 1.3030 -0.1106 -4.5022
quadrupole: -1.9780 -2.5049 4.4830 1.3030 -0.1106 -4.5022
hfenergy: -218.4335046 hartree
pointgroup: C01 [X(C3H4Br2O1)]
dipole: 0.3745695 0.5891415 0.5904663 debye
dipolederiv: -0.6756236 -0.1210909 0.0085021 -0.1718496 -0.2685539 -0.0010053 0.0160981 0.042111 -0.0874454 -0.6306278 -0.0147166 0.0218636 0.0057788 -0.1002223 0.0181837 0.0483468 0.0216908 -0.1316988 -0.337434 -0.053042 -0.1234679 -0.064977 -0.7012796 -0.0976795 -0.192431 -0.2827217 -0.4726287 0.8435388 0.1137404 -0.1282832 0.0834119 -0.1777881 0.005763 -0.033323 0.0058131 0.0611468 0.6353999 0.0840653 -0.1581288 0.04707 0.001256 -0.0119088 -0.0792731 -0.0036723 0.0991953 0.2103441 -0.0459002 0.3411968 0.1186015 1.1102013 0.0546537 0.3423485 0.1396986 0.5432937 -0.0115232 0.0053627 0.0444225 -0.0314742 0.0564742 0.0145499 -0.0024034 -0.0182099 -0.0231646 -0.0408001 -0.0567506 0.0501937 0.0008848 -0.0228214 0.022474 0.0254564 0.0200266 0.1021924 -0.0145633 -0.006114 0.0890275 -0.0445827 0.1183647 -0.0566079 0.0099007 -0.0139119 0.0118892 0.0212893 0.0944457 -0.1453262 0.0571364 -0.015631 0.0515772 -0.1347199 0.0891758 -0.1027798 unknown
polarizability: 107.2262933|15.2417781|53.0081104|-6.2128543|-1.2918879|41.3669263 unknown
InChI: InChI=1S/C3H4Br2O/c4-1-3(5)2-6/h2-3H,1H2
charge 0 multiplicity 1
10 atoms
Br 2.201191 1.146687 0.015215
Br -2.535428 0.608029 0.254355
O  0.086472 -1.809502 -0.524128
C  0.329439 0.406619 0.495782
C  -0.67652 0.990195 -0.47885
C  0.53051 -1.109935 0.411401
H  0.189383 0.748714 1.533127
H  -0.615329 2.083372 -0.554121
H  -0.637105 0.497445 -1.460315
H  1.130686 -1.544324 1.244635
