program: Gaussian 09
title: 000092236
version: EM64L-G09RevD.01
frameworkgroup: C1[X(C13H12O3)]
method: RPBEPBE
basis: SDD
operation: Freq
keyword: #pfreq=noraman
keyword: PBEPBE/SDD
title: #p freq=noraman PBEPBE/SDD
converged: YES YES NO NO
title: Mulliken charges:
elementType: O O O C C C C C C C C C C C C C H H H H H H H H H H H H
charge: -0.266593 -0.423960 -0.194093 0.381426 0.372646 0.377843 -0.552389 -0.066656 -0.394368 -0.405996 -0.417999 -0.411498 -0.714247 -0.244921 -0.244965 0.172957 0.267042 0.245603 0.238869 0.254222 0.235544 0.237712 0.251286 0.244027 0.221944 0.226525 0.227438 0.382602
chargesum: 0.00000
title: Mulliken charges with hydrogens summed into heavy atoms:
elementType: O O O C C C C C C C C C C C C C
charge: -0.266593 -0.041357 -0.194093 0.381426 0.372646 0.377843 -0.285348 0.178947 -0.155500 -0.151775 -0.182455 -0.173785 0.003011 -0.018397 -0.017527 0.172957
polarizability: 2.19539084e+02 1.97683389e+01 1.57956577e+02 7.84819837e+00 -1.25783672e+01 8.46664664e+01
1716.lowfreq: -9.0310 -0.0007 -0.0006 0.0002 7.6325 9.5684 26.9937 43.6689 48.1583
frequency: 26.8969 43.6356 48.1025 97.3313 129.1367 184.4823 204.5263 226.0871 257.7948 261.8306 313.3725 318.6568 392.1462 403.5034 477.3880 490.5387 509.7367 516.7046 535.1064 603.3313 615.4326 629.9176 649.1518 706.6247 713.3289 756.3896 761.6185 777.1123 780.8949 823.8608 859.3731 872.7026 896.9315 922.0417 955.2624 960.3270 973.9075 988.7818 1020.1426 1025.2269 1032.5234 1086.9326 1118.0539 1135.5804 1148.8034 1169.0465 1180.9370 1234.0719 1239.1995 1260.1513 1278.5274 1319.0326 1345.9803 1353.3445 1390.4475 1414.8326 1426.3074 1440.6601 1461.7372 1463.4003 1474.1497 1518.0082 1586.8719 1604.0571 1637.7815 1682.7327 3003.5023 3018.3392 3106.3491 3117.8813 3118.8772 3124.1400 3132.3226 3141.6687 3147.7478 3161.6030 3170.2885 3507.1174
redmass: 10.9671 5.2342 4.8376 4.5985 4.6041 3.8608 3.4533 1.1784 4.2619 3.3130 5.0291 5.3225 4.7546 3.3004 2.4781 4.8653 5.4037 5.5236 3.5422 2.4084 2.7515 2.9026 2.8407 4.8421 4.4254 1.3117 4.9431 2.8062 2.6337 1.3493 1.4746 3.5950 1.7835 4.3626 1.3601 3.6863 1.3866 1.3441 2.6011 2.2288 2.4228 1.8833 1.7246 2.2211 1.2357 1.2493 1.5474 2.0585 1.5909 1.7450 1.8270 1.3180 1.5893 1.7180 1.2146 5.5572 3.7420 3.3659 1.8792 1.1893 1.0544 3.8819 7.4633 5.6964 6.7140 8.7985 1.0349 1.0853 1.0999 1.1016 1.0856 1.0890 1.0890 1.0947 1.0911 1.1003 1.0960 1.0641
irintensity: 1.6440 1.0812 0.1570 0.5511 0.4847 1.4129 1.3774 0.2663 1.2509 0.9874 0.5452 1.0791 7.6616 0.9122 23.7131 8.1299 0.5850 6.4167 0.2335 59.0068 26.5478 76.3079 1.8266 3.8737 46.3072 43.5708 0.1550 0.7490 0.9224 35.8265 68.4721 3.0967 9.9884 11.4467 4.7784 61.0815 3.2096 0.0483 260.2052 8.4217 36.2882 51.5547 22.1943 2.4425 2.0764 61.0148 132.7426 45.3777 2.7341 43.9659 5.2090 1.2477 12.1005 7.2936 24.3357 9.9711 9.0825 5.2663 46.4779 20.6554 13.1789 39.0403 9.9862 57.0484 75.7282 172.3444 14.3947 14.3179 16.0926 13.0436 4.9294 0.5022 9.2924 33.4239 9.4439 35.7409 6.8932 24.7824
temp: 298.150 k
press: 1.00000 atm
elementType: 8 8 8 6 6 6 6 6 6 6 6 6 6 6 6 6 1 1 1 1 1 1 1 1 1 1 1 1
symmnumber: 1
zpe: 571111.2 jmol-1
zpe.correction: 0.217525 hartree
zpe.thermalcorrener: 0.231475 hartree
zpe.thermalcorrenthalpy: 0.232419 hartree
zpe.thermalcorrgfe: 0.175461 hartree
zpe.sumelectzpe: -727.120997 hartree
zpe.sumelectthermal: -727.107047 hartree
zpe.sumelectthermalent: -727.106103 hartree
zpe.sumelectthermalfe: -727.163061 hartree
dipole: -0.4447 1.5349 -1.5509
dipole: 2.2269
quadrupole: -80.5070 -81.2279 -100.6829
quadrupole: -5.1594 7.3104 0.3932
quadrupole: 6.9656 6.2447 -13.2103 -5.1594 7.3104 0.3932
hfenergy: -727.3385219 hartree
pointgroup: C01 [X(C13H12O3)]
dipole: 0.1981766 0.5657763 0.6389189 debye
polarizability: 215.4460008|-25.0451744|160.3427972|12.4719004|13.8659978|86.37333 unknown
InChI: InChI=1S/C13H12O3/c1-9(13(14)15)16-12-7-6-10-4-2-3-5-11(10)8-12/h2-9,14H,1H3
charge 0 multiplicity 1
28 atoms
O  1.822062 -1.458823 0.332861
O  3.044497 1.89452 0.18983
O  3.241151 0.354724 -1.546671
C  -1.461467 0.420049 0.245587
C  -2.322759 -0.662174 -0.184738
C  0.467992 -1.090702 0.178877
C  -0.056438 0.182504 0.422477
C  2.77271 -0.431819 0.773276
C  -1.737186 -1.951556 -0.425611
C  -0.374778 -2.167114 -0.24918
C  -2.043328 1.709056 0.485908
C  -3.723265 -0.416468 -0.357499
C  4.075257 -1.173028 1.103431
C  -3.413861 1.919924 0.310036
C  -4.263196 0.849823 -0.1152
C  3.026141 0.594927 -0.345269
H  0.574732 1.017866 0.743138
H  2.382019 0.099766 1.661253
H  -2.381636 -2.775009 -0.754788
H  0.085428 -3.142691 -0.431253
H  -1.395501 2.531713 0.812255
H  -4.368866 -1.240803 -0.684048
H  4.441811 -1.705212 0.210131
H  3.886315 -1.906273 1.904656
H  4.849082 -0.463525 1.444933
H  -3.844822 2.909744 0.49752
H  -5.335503 1.02865 -0.249554
H  3.267311 2.548833 -0.527658
