program: Gaussian 09
title: 000092328
version: EM64L-G09RevD.01
frameworkgroup: C1[X(C14H10Br4O4)]
method: RPBEPBE
basis: SDD
operation: Freq
keyword: #p
keyword: freq=noraman
keyword: PBEPBE/SDD
title: #p freq=noraman PBEPBE/SDD
converged: YES YES NO NO
title: Mulliken charges:
elementType: Br Br Br Br O O O O C C C C C C C C C C C C C C H H H H H H H H H H
charge: 0.113203 0.094221 0.137867 0.140959 -0.263692 -0.223133 -0.184747 -0.222077 0.337176 0.393050 -0.393693 -0.345889 -0.173107 -0.172639 0.126717 0.125152 -0.323656 -0.326303 -0.048439 -0.032859 -0.565026 -0.551215 0.247337 0.248153 0.245427 0.244818 0.240835 0.234001 0.224828 0.228660 0.224952 0.219119
chargesum: 0.00000
title: Mulliken charges with hydrogens summed into heavy atoms:
elementType: Br Br Br Br O O O O C C C C C C C C C C C C C C
charge: 0.113203 0.094221 0.137867 0.140959 -0.263692 -0.223133 -0.184747 -0.222077 0.337176 0.393050 -0.393693 -0.345889 -0.173107 -0.172639 0.126717 0.125152 0.171835 0.163942 0.192395 0.201142 -0.111538 -0.107143
polarizability: 3.27577563e+02 5.91142800e+00 2.70069707e+02 2.07634218e+00 -5.39416383e+00 1.37470268e+02
1716.lowfreq: -3.7522 -2.7920 -0.9408 -0.0005 -0.0004 -0.0001 17.3109 24.2617 24.4353
frequency: 17.2856 24.2509 24.4226 31.7656 42.5671 51.1997 57.8132 62.5066 68.7264 77.5942 104.5968 112.1185 136.5207 139.6961 142.7499 151.0585 170.3752 192.2054 200.7160 202.5413 218.1954 224.0453 228.1604 257.6570 275.2153 316.4467 319.7721 365.1884 387.9547 434.6761 437.4874 520.8534 525.7387 528.4756 598.6186 609.9773 641.3940 652.7521 684.6275 713.4895 738.4028 749.0750 772.9545 831.1022 842.4240 873.9359 877.2580 928.9410 931.9135 961.8611 965.2647 973.9762 977.1683 1007.4108 1011.0249 1026.6438 1101.0865 1150.2591 1151.5260 1177.0971 1190.5066 1213.4458 1216.3912 1283.6732 1284.4847 1301.5433 1312.0921 1328.5631 1337.3760 1357.4895 1430.7216 1432.1364 1461.7709 1463.6926 1495.8306 1524.0338 1613.7360 1636.1050 1662.2908 1665.2704 3000.1767 3003.6970 3073.1852 3075.8014 3092.6601 3093.3845 3122.6922 3124.2204 3203.0960 3204.8110
redmass: 4.5934 5.5186 6.8071 9.7265 31.5078 4.1040 5.0951 3.3186 2.9429 4.7740 3.6022 8.5752 5.1643 17.6681 14.5310 42.1444 5.4822 6.1800 19.8721 11.0883 10.3434 9.7716 7.3371 10.1606 11.4868 3.9385 3.5590 5.5360 4.1964 3.4412 2.7587 6.6515 10.7020 11.2273 3.4567 2.4913 2.3112 3.1632 11.6351 9.8341 10.9135 11.6242 10.4930 8.2041 7.5408 4.7928 4.0389 1.5250 1.5862 1.3583 1.3720 1.7972 1.7998 1.3630 1.2698 6.5859 10.7655 1.7732 1.7232 6.8511 8.3959 1.2350 1.2310 1.2511 1.2530 7.2392 9.1420 1.6973 1.4443 4.1818 1.1865 1.1855 1.1052 1.1078 11.9262 11.9371 12.0959 12.3254 4.7493 4.7675 1.0582 1.0583 1.1051 1.1051 1.0608 1.0610 1.0950 1.0950 1.1145 1.1145
irintensity: 0.0278 0.2368 0.1937 0.2499 0.0080 0.0913 0.4540 1.5198 1.1441 2.0890 0.7255 0.2831 0.1557 0.2529 0.2352 0.0576 0.4365 3.0386 0.2596 0.3369 3.2502 2.6938 2.4340 4.1197 0.7129 12.3770 17.9339 1.6503 7.1845 14.5920 0.4195 17.5983 15.1308 25.6378 3.9854 7.2211 12.7905 12.1380 0.2536 3.4002 5.5019 6.2352 1.6101 19.3577 12.4309 33.9942 28.2617 54.1807 74.6844 64.6242 56.8050 30.4122 32.0030 14.5893 26.3557 22.0325 429.6198 11.8680 1.8647 242.1242 554.8880 4.4232 1.2863 2.3431 1.6959 109.9332 6.4884 32.8618 1.2039 40.5023 16.7666 11.5690 18.2070 2.3886 38.8123 23.6171 153.8142 219.5231 6.6681 3.5158 13.3397 12.6019 4.3036 5.8064 6.1424 9.1668 6.9586 6.5133 18.8172 20.9607
temp: 298.150 k
press: 1.00000 atm
elementType: 35 35 35 35 8 8 8 8 6 6 6 6 6 6 6 6 6 6 6 6 6 6 1 1 1 1 1 1 1 1 1 1
symmnumber: 1
zpe: 533568.2 jmol-1
zpe.correction: 0.203225 hartree
zpe.thermalcorrener: 0.227964 hartree
zpe.thermalcorrenthalpy: 0.228909 hartree
zpe.thermalcorrgfe: 0.142023 hartree
zpe.sumelectzpe: -892.545949 hartree
zpe.sumelectthermal: -892.521210 hartree
zpe.sumelectthermalent: -892.520266 hartree
zpe.sumelectthermalfe: -892.607152 hartree
dipole: -3.4218 -1.0161 2.6123
dipole: 4.4232
quadrupole: -134.1473 -157.9636 -171.2473
quadrupole: -1.6776 -6.2372 4.3503
quadrupole: 20.3055 -3.5109 -16.7946 -1.6776 -6.2372 4.3503
hfenergy: -892.7491742 hartree
pointgroup: C01 [X(C14H10Br4O4)]
dipole: -1.3917307 -0.4298575 0.9522288 debye
polarizability: 325.3119369|10.4725719|270.1361988|15.6431449|-11.4402293|139.6694017 unknown
InChI: InChI=1S/C14H10Br4O4/c1-3-5-21-13(19)7-8(14(20)22-6-4-2)10(16)12(18)11(17)9(7)15/h3-4H,1-2,5-6H2
charge 0 multiplicity 1
32 atoms
Br 2.662952 3.302247 0.264209
Br 1.347245 -3.269257 -0.232722
Br 5.089114 1.056674 0.954112
Br 4.436827 -2.243367 0.689628
O  -1.232847 1.68508 -0.020557
O  -1.316017 -1.464707 0.342937
O  0.079831 2.819605 -1.579982
O  -1.152569 -0.712776 -1.861458
C  1.019231 0.959517 -0.279107
C  0.72633 -0.430698 -0.313004
C  2.312838 1.396798 0.101007
C  1.744154 -1.371992 -0.037365
C  3.326693 0.452378 0.412688
C  3.047175 -0.940801 0.323056
C  -0.04987 1.935274 -0.709726
C  -0.663692 -0.874558 -0.720066
C  -2.430973 2.463063 -0.493549
C  -2.714067 -1.952378 0.064398
C  -3.551788 2.162132 0.45932
C  -3.114625 -2.827685 1.216687
C  -4.773983 1.724225 0.066855
C  -4.245911 -2.641563 1.93949
H  -2.150899 3.533497 -0.495103
H  -2.652342 2.151391 -1.529476
H  -3.365861 -1.067534 -0.043196
H  -2.686211 -2.500452 -0.896771
H  -3.3398 2.347499 1.520793
H  -2.442995 -3.668765 1.435532
H  -5.582809 1.567331 0.788765
H  -5.00668 1.531353 -0.987889
H  -4.52952 -3.326064 2.745846
H  -4.921431 -1.799668 1.742546
