program: Gaussian 09
title: 000092434
version: EM64L-G09RevD.01
frameworkgroup: C1[X(C17H19F3N6O6S)]
method: RPBEPBE
basis: SDD
operation: Freq
keyword: #p
keyword: freq=noraman
keyword: PBEPBE/SDD
title: #p freq=noraman PBEPBE/SDD
converged: YES YES NO NO
title: Mulliken charges:
elementType: S F F F O O O O O O N N N N N N C C C C C C C C C C C C C C C C C H H H H H H H H H H H H H H H H H H H
charge: 0.964172 -0.147283 -0.169018 -0.148959 -0.485860 -0.526120 -0.264533 -0.217999 -0.199917 -0.211394 -0.674866 -0.417161 -0.121564 -0.078172 -0.099706 -0.173096 -0.260302 0.494081 0.350710 -0.375509 -0.380665 -0.804912 -0.211900 0.146753 0.363501 0.063948 0.204661 0.083614 -0.629828 -0.622164 -0.501826 -0.305098 0.378129 0.245949 0.275674 0.230158 0.270033 0.259868 0.335833 0.241905 0.340773 0.227096 0.322646 0.222890 0.229605 0.277995 0.232277 0.265850 0.244461 0.233726 0.260462 0.261084
chargesum: 0.00000
title: Mulliken charges with hydrogens summed into heavy atoms:
elementType: S F F F O O O O O O N N N N N N C C C C C C C C C C C C C C C C C
charge: 0.964172 -0.147283 -0.169018 -0.148959 -0.485860 -0.526120 -0.264533 -0.217999 -0.199917 -0.211394 -0.339033 -0.076388 -0.121564 -0.078172 -0.099706 -0.173096 -0.260302 0.494081 0.350710 -0.129560 -0.104991 -0.044854 0.030005 0.146753 0.363501 0.063948 0.204661 0.083614 0.142804 0.117714 0.242211 0.216449 0.378129
polarizability: 3.48137765e+02 3.82928287e+00 3.05577737e+02 -1.10855039e+01 -6.68471597e-01 2.30216814e+02
1716.lowfreq: -2.0850 -1.7571 -0.0007 0.0002 0.0010 3.4362 5.7533 12.0012 18.0240
frequency: 5.6936 11.9599 18.0014 25.0133 32.8732 41.3946 44.2217 57.0202 67.6409 69.1086 78.1125 81.9368 89.6243 91.9546 102.1601 120.0307 123.8722 126.3611 139.8303 141.9447 152.6191 161.4810 177.9315 179.6728 208.7792 209.2328 214.2435 220.2333 230.9405 240.1848 251.9026 259.4620 269.0550 284.2781 288.7135 315.1182 322.4919 336.9457 338.8302 345.7201 371.2159 383.5380 387.5881 424.9437 444.5264 462.1115 466.2602 483.2448 506.9709 520.6707 523.6993 552.3995 554.4442 563.7034 586.9598 644.1404 649.3922 672.6096 682.8874 691.5805 696.7299 720.7994 724.7124 733.0477 750.9073 758.9909 790.4345 794.2322 806.7774 813.4418 855.5737 879.9888 896.3257 900.1945 922.0238 929.3609 941.3449 954.5742 976.3160 994.1026 995.9657 1015.3229 1017.5644 1044.5192 1052.7515 1056.6961 1075.1664 1077.3452 1094.9676 1097.4413 1113.4556 1115.3031 1129.9824 1151.2672 1155.5894 1183.1950 1210.6642 1221.4848 1234.0171 1236.2252 1255.9102 1256.7868 1268.4955 1306.0917 1318.5149 1363.9667 1365.6704 1377.8174 1394.4282 1403.2720 1415.3392 1415.6679 1420.2974 1442.1839 1450.2071 1452.2256 1457.0224 1464.5610 1467.1065 1468.3728 1468.9090 1480.3159 1488.4120 1491.4095 1495.6568 1542.7129 1567.3915 1599.5539 1603.7475 1640.8375 1646.9237 2971.9650 2977.1053 2994.1679 3008.8442 3034.6383 3047.5837 3052.5719 3082.3122 3099.4751 3102.3917 3117.6768 3125.9286 3135.9633 3136.8815 3154.3766 3154.9529 3172.9751 3482.8860 3522.3749
redmass: 6.2054 6.2676 7.4571 7.7700 10.3427 10.1879 8.5998 5.9184 5.0238 5.3454 5.4176 1.2941 2.8654 3.3715 1.3870 5.6024 1.6446 4.1227 4.0215 4.9740 8.6236 1.8331 4.8497 1.3190 6.2209 5.5022 7.4960 4.2647 6.4522 6.6184 6.2240 7.0753 5.3401 4.4024 3.7608 7.9639 3.6371 4.6721 6.2248 4.8295 3.6582 1.5229 5.3503 5.4750 6.8509 5.2820 7.0888 7.8634 4.1138 4.7830 5.1972 5.8813 7.7357 5.9190 7.5752 1.7063 7.3972 7.0483 6.4969 8.7021 7.6650 4.7824 3.7656 5.3794 4.5600 8.1300 10.4260 6.0401 1.4744 13.9163 5.6087 7.2452 2.5223 8.5584 1.4173 8.1872 4.8244 11.1355 6.6992 6.1356 1.4314 1.6746 7.6901 2.8816 1.5354 1.4195 6.1010 2.8716 2.0997 1.2187 1.4794 1.8509 1.8478 1.3741 1.4771 1.2584 3.5594 3.4826 1.3330 5.3309 1.7276 6.4092 4.5201 1.8827 4.3431 5.2909 2.7266 2.8347 2.6045 1.2534 1.2094 1.2235 1.2208 1.4572 1.0533 2.3980 1.6503 1.7065 1.1199 1.0600 1.1800 1.0445 1.1685 1.8893 1.0458 3.5622 5.1208 4.2657 7.8355 10.3342 8.5693 1.0360 1.0365 1.0365 1.0286 1.0570 1.1014 1.1017 1.0974 1.1005 1.1068 1.1052 1.0991 1.0966 1.0879 1.1050 1.0918 1.0993 1.0791 1.0764
irintensity: 0.7592 0.7872 0.1680 0.3596 0.7056 0.8219 2.5486 0.9419 0.1085 1.6401 4.3352 0.7885 0.9473 1.6704 0.6505 1.7973 1.0130 0.8545 5.9102 4.2421 0.1873 3.3038 2.4342 1.8240 0.4582 9.6223 1.0352 2.6569 0.7862 0.6291 0.5691 18.0995 20.3117 3.4585 8.2753 4.0771 1.4192 4.7001 5.5365 7.6641 5.9572 24.6946 82.6439 50.0952 27.5079 34.1199 1.8130 28.2705 2.0031 5.6051 5.2898 29.2781 57.1589 93.6945 13.3469 76.8991 25.1897 8.4773 21.4961 28.6476 11.9192 40.1984 29.5559 121.7328 7.8107 5.1173 33.6029 46.2354 34.3287 122.4704 6.2844 7.5435 84.8886 9.7694 3.2762 52.7315 17.0855 50.8602 25.7744 120.9516 1.1374 5.3568 272.2510 280.0441 13.6741 2.3316 28.5219 138.0621 91.6378 0.2673 65.7951 289.0274 51.3062 0.1232 26.2731 20.4529 159.4320 369.6872 69.7331 10.4543 19.1588 28.4525 132.3452 238.1520 765.3651 4.3577 30.5381 242.9729 7.7353 20.9294 34.8347 56.5211 95.1492 146.2503 11.8827 5.3631 102.6495 578.8186 6.0359 17.7684 372.5305 5.2373 204.5788 587.5185 29.1430 192.6024 7.8256 416.5110 7.0336 76.6004 312.4147 18.1980 138.3115 15.6903 30.3452 19.2407 34.5452 22.5422 14.1286 5.2990 5.2065 15.5218 0.8221 2.2673 4.3713 12.0156 6.4883 10.6020 23.6540 53.8901
temp: 298.150 k
press: 1.00000 atm
elementType: 16 9 9 9 8 8 8 8 8 8 7 7 7 7 7 7 6 6 6 6 6 6 6 6 6 6 6 6 6 6 6 6 6 1 1 1 1 1 1 1 1 1 1 1 1 1 1 1 1 1 1 1
symmnumber: 1
zpe: 959005.3 jmol-1
zpe.correction: 0.365266 hartree
zpe.thermalcorrener: 0.400115 hartree
zpe.thermalcorrenthalpy: 0.401059 hartree
zpe.thermalcorrgfe: 0.292612 hartree
zpe.sumelectzpe: -2134.029348 hartree
zpe.sumelectthermal: -2133.994499 hartree
zpe.sumelectthermalent: -2133.993554 hartree
zpe.sumelectthermalfe: -2134.102002 hartree
dipole: 1.3678 5.7809 3.9532
dipole: 7.1357
quadrupole: -214.6093 -186.7967 -188.3459
quadrupole: -19.3200 13.2881 6.1419
quadrupole: -18.0253 9.7873 8.2381 -19.3200 13.2881 6.1419
hfenergy: -2134.3946134 hartree
pointgroup: C01 [X(C17H19F3N6O6S1)]
dipole: -0.4668474 -0.8891809 2.621606 debye
polarizability: 348.612143|7.9364524|279.1324298|3.4467154|-36.2367342|256.187743 unknown
InChI: InChI=1S/C17H19F3N6O6S/c1-9-6-5-7-10(12(27)31-4)11(9)33(29,30)25-15(28)22-13-21-14(26(2)3)24-16(23-13)32-8-17(18,19)20/h5-7,22,25H,8H2,1-4H3
charge 0 multiplicity 1
52 atoms
S  -3.512437 1.313151 -1.198748
F  7.445834 0.95113 -2.537774
F  8.705622 0.113319 -0.841515
F  7.572513 2.0649 -0.568774
O  -3.550952 0.177942 -2.347803
O  -4.011474 2.824591 -1.520142
O  -6.133379 -0.297781 -1.489593
O  -5.397214 -2.458006 -0.9633
O  -1.274244 -0.528586 -0.022984
O  5.105944 0.677518 -0.939019
N  -1.711279 1.621296 -0.820544
N  0.503658 0.894569 -0.733515
N  2.749138 -2.732079 1.321453
N  1.573746 -0.945992 0.348874
N  2.809151 0.784792 -0.841278
N  4.004071 -1.058897 0.202421
C  -4.159715 0.661839 0.49192
C  -3.841021 1.397547 1.655576
C  -4.870105 -0.5574 0.489867
C  -4.204961 0.78384 2.886508
C  -5.16896 -1.146674 1.740748
C  -3.163803 2.75515 1.675637
C  -4.824163 -0.481089 2.934361
C  -5.434106 -1.231598 -0.731158
C  -0.850815 0.553153 -0.49246
C  1.655898 0.186448 -0.376133
C  2.778603 -1.56174 0.614475
C  3.926275 0.09698 -0.498691
C  1.470591 -3.323135 1.759313
C  3.977235 -3.463719 1.664828
C  -6.616554 -0.761074 -2.812863
C  6.333842 -0.04607 -0.596584
C  7.487452 0.783468 -1.142959
H  -3.978324 1.318016 3.816058
H  -5.692222 -2.107708 1.752281
H  -3.398181 3.275753 2.619239
H  -3.490428 3.389385 0.834556
H  -2.066243 2.650181 1.607446
H  -1.4103 2.517663 -1.223428
H  -5.063512 -0.935625 3.900959
H  0.724617 1.7349 -1.275949
H  1.364368 -4.341427 1.340245
H  0.644164 -2.690656 1.40486
H  1.441968 -3.390375 2.863452
H  4.06193 -3.571104 2.762959
H  4.846986 -2.912482 1.282581
H  3.957068 -4.474789 1.215478
H  -5.750437 -0.818826 -3.492516
H  -7.099004 -1.748045 -2.721481
H  -7.328156 0.008707 -3.141103
H  6.444733 -0.154327 0.49572
H  6.349381 -1.047934 -1.0586
