program: Gaussian 09
title: 000092191
version: EM64L-G09RevD.01
frameworkgroup: C1[X(C7H14N2O3)]
method: RPBEPBE
basis: SDD
operation: Freq
keyword: #p
keyword: freq=noraman
keyword: PBEPBE/SDD
title: #p freq=noraman PBEPBE/SDD
converged: YES YES NO NO
title: Mulliken charges:
elementType: O O O N N C C C C C C C H H H H H H H H H H H H H H
charge: -0.419994 -0.222910 -0.270840 -0.343130 -0.621407 -0.137809 -0.449556 -0.523900 -0.328253 0.164137 0.233354 -0.697800 0.242613 0.242745 0.262528 0.287302 0.219031 0.267092 0.179013 0.240025 0.235989 0.202268 0.215373 0.375027 0.315437 0.333665
chargesum: 0.00000
title: Mulliken charges with hydrogens summed into heavy atoms:
elementType: O O O N N C C C C C C C
charge: -0.044967 -0.222910 -0.270840 -0.076038 0.027695 0.104803 0.055717 -0.017568 0.090785 0.164137 0.233354 -0.044169
polarizability: 1.09851579e+02 -2.01078388e-01 9.74013889e+01 -8.92674615e-01 4.03380959e+00 9.09742109e+01
1716.lowfreq: -12.1318 -6.4702 0.0003 0.0008 0.0008 6.1764 27.2463 33.6037 42.4942
frequency: 27.2030 33.5794 42.4773 67.2717 75.3398 97.0896 122.8911 177.5498 211.7272 240.3563 271.0661 315.7717 339.9642 417.8144 466.0502 495.9341 508.7282 526.8465 554.1320 580.1128 614.1503 653.1633 655.2831 711.9746 787.9013 803.7946 819.2797 893.5635 907.0425 966.7019 1002.6465 1023.3015 1055.1294 1065.0444 1091.5027 1118.8480 1136.2037 1176.6548 1207.8486 1214.9075 1245.9646 1266.3156 1276.7226 1278.5447 1341.6373 1354.5230 1362.2471 1378.5709 1391.5635 1439.5665 1453.8697 1470.9352 1480.5247 1485.4828 1496.3526 1593.4648 1640.2459 1669.0525 2863.2048 2876.7129 2976.7403 2979.5126 3003.1310 3029.1921 3034.7827 3073.8251 3076.9026 3095.8666 3449.4599 3514.9106 3516.6943 3673.7498
redmass: 5.5221 6.0743 6.4432 2.0828 4.0609 2.2304 3.4711 4.7864 2.9186 1.4504 2.3483 3.8663 3.3117 2.6360 3.3198 1.8942 1.9285 1.5381 1.6709 1.9158 1.6842 2.1568 1.9724 3.9253 1.6296 2.0215 1.4354 3.1389 1.7235 2.6732 2.1587 3.0187 2.0670 2.2296 3.1097 1.6828 1.4266 2.4877 1.5424 1.3956 1.5363 1.2093 1.5972 1.2213 1.5393 1.7174 1.3698 2.1957 1.2453 1.1121 1.1429 1.0497 1.0410 1.1591 1.0858 1.4519 3.4317 8.4462 1.0724 1.0801 1.0602 1.0379 1.0624 1.0869 1.0992 1.0974 1.1010 1.1003 1.0748 1.0641 1.0445 1.1044
irintensity: 0.4539 12.7202 2.7463 0.8927 3.1578 3.5365 1.1278 8.7421 7.1641 0.8388 2.8693 1.9188 2.2873 5.3381 0.9436 10.7240 88.7055 86.7669 149.9485 93.4004 21.9362 83.6383 60.2548 15.9567 14.7636 5.3732 7.4830 4.0132 0.8666 12.9738 9.8436 308.4634 8.4420 23.4706 10.0868 0.9441 6.4376 47.8418 1.4748 17.7901 13.4538 28.8713 67.0578 3.4076 32.0163 75.0102 1.8156 75.1985 17.7510 8.4299 31.3480 25.1738 6.3756 3.1354 5.2072 63.9514 274.5071 187.8916 106.9539 79.7927 24.2486 29.0379 17.7125 9.3206 13.2105 51.9542 20.6601 35.5781 0.6446 25.1895 30.6976 22.7585
temp: 298.150 k
press: 1.00000 atm
elementType: 8 8 8 7 7 6 6 6 6 6 6 6 1 1 1 1 1 1 1 1 1 1 1 1 1 1
symmnumber: 1
zpe: 563842.6 jmol-1
zpe.correction: 0.214756 hartree
zpe.thermalcorrener: 0.228921 hartree
zpe.thermalcorrenthalpy: 0.229865 hartree
zpe.thermalcorrgfe: 0.171469 hartree
zpe.sumelectzpe: -609.367830 hartree
zpe.sumelectthermal: -609.353666 hartree
zpe.sumelectthermalent: -609.352721 hartree
zpe.sumelectthermalfe: -609.411118 hartree
dipole: -0.0632 1.8554 1.2065
dipole: 2.2141
quadrupole: -65.7214 -67.9382 -75.8099
quadrupole: -7.1365 -15.3014 -0.2760
quadrupole: 4.1018 1.8850 -5.9867 -7.1365 -15.3014 -0.2760
hfenergy: -609.5825868 hartree
pointgroup: C01 [X(C7H14N2O3)]
dipole: 0.0273706 0.6661056 -0.560662 debye
dipolederiv: -0.4038671 -0.0363971 0.0054957 -0.0401621 -1.1958025 -0.3585787 0.0237132 -0.2915219 -0.3542063 -0.3905013 -0.0603568 -0.1738853 0.0444387 -0.6164314 0.0754949 -0.2331062 -0.1805518 -0.8502664 -0.6918573 0.1644152 -0.0875035 0.093602 -0.5342883 0.2936984 0.1049014 0.2001703 -0.8751759 -0.7749051 -0.1890609 0.0984748 -0.1900791 -0.5220786 -0.1381849 0.1284827 -0.2129032 -0.3679898 -0.865866 -0.2040708 0.4676423 -0.1497022 -0.5677617 -0.1378679 0.3788581 -0.090529 -0.7896909 0.1010355 0.2201042 -0.150925 0.2592382 0.4817719 0.1304232 -0.1880493 0.1659749 0.1731953 0.1515204 -0.0943561 0.0390841 0.0176963 0.0294058 0.0574038 -0.095226 0.0522851 0.0467589 -0.4651523 0.1522431 0.0124588 0.1248948 0.0769278 -0.0104112 -0.1542414 -0.0056749 -0.0411497 0.6914499 0.1315184 -0.1137224 0.0145324 0.1240659 0.0294125 -0.0028765 0.0597103 0.3352886 0.2910754 0.0028603 0.304425 -0.1349425 1.4531642 0.1481349 0.3599333 0.2670872 1.0199826 1.3145125 -0.184611 -0.3857634 -0.1953993 0.4304066 -0.3635781 -0.3856128 -0.3539354 1.2468238 -0.0076082 -0.0725803 -0.0022916 -0.073877 -0.036112 -0.0506253 0.0155395 -0.0497992 0.0713976 -0.032409 0.0558522 0.1038876 -0.0232748 -0.082485 -0.0770382 0.0505541 -0.1212596 -0.1278111 0.0218089 -0.0631846 0.0036747 -0.0675691 -0.0685587 -0.0907502 0.0182406 -0.0623148 0.0469841 0.1112009 0.010666 -0.0420095 -0.0190145 0.0204387 0.1054651 0.0337892 0.0682217 0.0026517 0.1995993 -0.0293211 -0.0688428 0.0266904 0.008367 -0.0590446 -0.0352966 -0.0440584 0.0557416 0.0390989 -0.0176977 0.0431248 0.0084125 -0.0535891 0.1113963 0.0597786 0.0969215 -0.0283006 0.1546742 -0.0186412 -0.0689048 0.0248529 0.1015788 0.0714366 -0.1438137 0.151002 0.1407625 -0.1738144 -0.0413123 0.0848223 0.0457859 -0.009404 -0.1015648 0.2011266 -0.0765045 -0.1795721 0.0145244 0.0312725 -0.0238387 0.0818392 -0.0171566 0.0808427 -0.066803 0.0804686 -0.0208119 0.0773381 0.0594736 0.1038788 0.0184921 0.0557978 -0.0413995 0.0698418 -0.0790812 -0.0869866 0.0651374 0.0868604 -0.0799534 0.0254427 -0.0441656 0.0844741 -0.0712691 0.131603 -0.0534002 -0.1896502 -0.0744919 -0.0231668 -0.0331932 0.0627709 -0.0047328 -0.017226 -0.0066463 0.1060174 0.3605318 0.0235509 -0.0581836 0.0001551 0.2994088 0.0654855 -0.0738282 0.1262331 0.141015 0.2242716 0.0681162 -0.0095833 0.0717006 0.2947979 0.0994157 -0.0101855 0.0977098 0.1843292 0.177852 0.0791487 0.0216053 0.06944 0.3089314 0.0806924 0.0327753 0.077393 0.2044133 unknown
polarizability: 109.758623|-0.472373|96.345587|-1.6223442|-4.6446605|92.1229687 unknown
InChI: InChI=1S/C7H14N2O3/c1-2-9-5(7(11)12)3-4-6(8)10/h5,9,11H,2-4,8H2,1H3
charge 0 multiplicity 1
26 atoms
O  -1.077106 2.749098 0.241986
O  -1.565918 1.309059 -1.51067
O  3.022734 -1.336475 0.935696
N  -1.39119 -0.915015 0.332622
N  3.704438 -0.555155 -1.136409
C  -0.876634 0.400542 0.725665
C  0.670932 0.335963 0.893991
C  1.400383 -0.054484 -0.409016
C  -2.860689 -1.071402 0.264419
C  -1.223549 1.466255 -0.320904
C  2.764942 -0.69384 -0.12663
C  -3.229289 -2.52418 -0.07972
H  -1.299136 0.776159 1.690052
H  1.033673 1.30619 1.275412
H  0.908437 -0.424568 1.662784
H  0.774848 -0.798448 -0.94318
H  1.509944 0.813761 -1.085972
H  -0.945043 -1.662622 0.880543
H  -3.36153 -0.773281 1.220012
H  -3.240415 -0.39929 -0.526818
H  -2.775776 -2.814321 -1.043357
H  -2.868839 -3.226002 0.697344
H  -4.324881 -2.641423 -0.156199
H  -1.275615 3.431977 -0.454745
H  3.503402 -0.042112 -1.992805
H  4.612575 -1.005386 -1.023902
