program: Gaussian 09
title: 000092169
version: EM64L-G09RevD.01
frameworkgroup: C1[X(C9H17NO3)]
method: RPBEPBE
basis: SDD
operation: Freq
keyword: #p
keyword: freq=noraman
keyword: PBEPBE/SDD
title: #p freq=noraman PBEPBE/SDD
converged: YES YES NO NO
title: Mulliken charges:
elementType: O O O N C C C C C C C C C H H H H H H H H H H H H H H H H H
charge: -0.437278 -0.419754 -0.228896 -0.184811 0.295011 0.403525 -0.211056 -0.571569 -0.719455 -0.730545 -0.747098 -0.753810 0.116352 0.273262 0.263140 0.228482 0.216297 0.207000 0.245168 0.225875 0.231950 0.228673 0.209837 0.213876 0.251701 0.230856 0.207642 0.219835 0.359566 0.376224
chargesum: 0.00000
title: Mulliken charges with hydrogens summed into heavy atoms:
elementType: O O O N C C C C C C C C C
charge: -0.077712 -0.043530 -0.228896 -0.184811 0.295011 0.403525 0.062206 -0.079947 -0.050990 -0.044048 -0.071684 -0.095477 0.116352
polarizability: 1.28358662e+02 2.13648151e+00 1.10124591e+02 3.83046144e-01 2.29138047e+00 1.00039961e+02
1716.lowfreq: -11.4174 -0.0008 -0.0003 0.0005 6.8705 8.0632 47.9507 49.4824 110.9770
frequency: 47.9325 49.4062 110.9689 143.6515 197.7480 203.6741 214.9813 224.4361 230.3787 265.9902 271.3073 280.6681 297.8778 310.8139 329.0340 346.2449 355.2670 388.3231 417.6910 478.5920 528.2331 553.5217 574.2632 590.3224 614.8470 633.9539 699.4364 764.5274 810.9326 877.6877 904.6296 922.5013 936.2081 945.7478 950.4848 962.5701 994.1056 996.6646 1021.1782 1030.9976 1071.4829 1110.0726 1164.1745 1173.4632 1191.0991 1211.4684 1239.5554 1244.4674 1247.6896 1266.5705 1294.7798 1302.5412 1363.2097 1371.6335 1373.7453 1387.4265 1391.3766 1453.6554 1457.6200 1463.3988 1468.2540 1473.6618 1475.1134 1480.3644 1484.6283 1492.9695 1661.8054 2979.6356 2982.6190 2988.8661 2995.3014 3019.8770 3035.6936 3074.5787 3076.3001 3079.0437 3085.1126 3091.3439 3092.6235 3097.6748 3098.2115 3107.2041 3505.2358 3548.8288
redmass: 8.3919 4.2081 3.2498 4.5303 1.2930 1.5919 1.3452 2.0792 1.4471 2.1135 1.2499 2.9789 2.8884 2.4766 3.2531 1.1915 2.0294 2.8594 2.7150 2.7165 3.7066 4.0009 2.8654 2.7499 3.9452 1.6080 3.1913 3.3886 3.1660 3.5470 2.2664 1.5554 1.7272 2.2467 2.1532 2.1225 1.2952 1.8453 1.7976 2.6429 1.6291 2.0064 2.4552 2.3743 2.4825 2.4824 1.6464 1.9184 1.6682 1.5526 1.5704 1.7703 1.6557 1.2892 1.2255 1.2038 1.1980 1.0534 1.0584 1.0509 1.0727 1.0543 1.0587 1.0561 1.0572 1.0524 8.2689 1.0352 1.0354 1.0356 1.0359 1.0597 1.0848 1.0992 1.0992 1.0995 1.1034 1.1004 1.0991 1.1002 1.0995 1.0991 1.0639 1.0682
irintensity: 1.1701 0.5347 0.7977 0.2186 0.4936 1.8688 0.5880 1.0599 3.1379 1.0361 5.5261 15.0624 1.8870 0.7290 1.5657 70.8061 15.7745 5.6365 2.3493 3.1411 14.6041 11.6073 24.1749 31.4318 5.8868 103.9891 18.1448 8.6088 0.3528 7.8002 19.4422 2.9440 10.2478 14.2193 1.6720 21.4136 4.8774 5.7295 3.0614 145.0234 83.2879 16.0362 36.4800 25.4287 24.5445 11.9570 15.7022 18.2946 15.9682 20.8163 11.0359 43.1237 31.7412 13.6617 54.1633 30.2184 9.9878 0.2420 1.1402 3.5170 15.2744 5.8046 7.0017 16.1296 3.1509 12.1473 199.2400 29.6373 22.7484 21.4917 18.3692 17.2822 5.8878 13.6561 24.2620 45.1492 3.8424 50.5493 22.8519 14.8026 18.7671 30.6457 20.9894 18.6045
temp: 298.150 k
press: 1.00000 atm
elementType: 8 8 8 7 6 6 6 6 6 6 6 6 6 1 1 1 1 1 1 1 1 1 1 1 1 1 1 1 1 1
symmnumber: 1
zpe: 661847.0 jmol-1
zpe.correction: 0.252084 hartree
zpe.thermalcorrener: 0.266891 hartree
zpe.thermalcorrenthalpy: 0.267835 hartree
zpe.thermalcorrgfe: 0.211843 hartree
zpe.sumelectzpe: -632.487656 hartree
zpe.sumelectthermal: -632.472850 hartree
zpe.sumelectthermalent: -632.471906 hartree
zpe.sumelectthermalfe: -632.527898 hartree
dipole: -0.2756 0.5842 0.5909
dipole: 0.8755
quadrupole: -73.9340 -80.5893 -80.6275
quadrupole: 3.9360 5.3086 -6.3378
quadrupole: 4.4496 -2.2057 -2.2439 3.9360 5.3086 -6.3378
hfenergy: -632.7397407 hartree
pointgroup: C01 [X(C9H17N1O3)]
dipole: -0.1192599 -0.2235242 -0.2333556 debye
polarizability: 128.1399095|-2.8918494|110.3096168|-0.4404249|2.3858347|100.0736886 unknown
InChI: InChI=1S/C9H17NO3/c1-8(2)5-6(7(11)12)9(3,4)10(8)13/h6,11,13H,5H2,1-4H3
charge 0 multiplicity 1
30 atoms
O  -2.249474 -1.482682 0.404697
O  3.142842 -0.136988 -0.87152
O  2.622582 1.285715 0.884491
N  -1.179273 -0.457588 0.602386
C  0.166009 -0.981804 0.095582
C  -1.549581 0.83592 -0.093332
C  0.808579 0.338815 -0.519863
C  -0.147478 1.493304 -0.123412
C  0.92347 -1.530166 1.327281
C  0.060509 -2.084133 -0.985266
C  -2.144024 0.653545 -1.516633
C  -2.548648 1.599786 0.797468
C  2.233367 0.577597 -0.069805
H  0.833267 0.215214 -1.616512
H  0.122389 1.876932 0.875885
H  -0.102267 2.330967 -0.840428
H  0.337756 -2.353101 1.775155
H  1.914352 -1.931436 1.044242
H  1.056816 -0.74759 2.093011
H  1.074904 -2.326892 -1.351206
H  -0.396058 -2.996519 -0.567913
H  -0.555934 -1.763441 -1.841619
H  -2.539293 1.618114 -1.884151
H  -1.396016 0.295531 -2.245539
H  -2.971412 -0.075683 -1.484581
H  -2.16554 1.667805 1.830583
H  -2.716682 2.622512 0.413092
H  -3.524151 1.079855 0.818405
H  -2.544702 -1.65689 1.335369
H  4.066194 0.020201 -0.532167
