program: Gaussian 09
title: 000092184
version: EM64L-G09RevD.01
frameworkgroup: C1[X(C8H15BrO2)]
method: RPBEPBE
basis: SDD
operation: Freq
keyword: #p
keyword: freq=noraman
keyword: PBEPBE/SDD
title: #p freq=noraman PBEPBE/SDD
converged: YES YES NO NO
title: Mulliken charges:
elementType: Br O O C C C C C C C C H H H H H H H H H H H H H H H
charge: 0.016162 -0.398756 -0.211569 -0.364739 -0.385672 -0.354987 -0.327430 -0.355338 -0.581008 -0.694741 0.251050 0.190598 0.199841 0.194590 0.223015 0.192273 0.188026 0.250164 0.231171 0.197647 0.195290 0.322648 0.209638 0.217043 0.210929 0.384154
chargesum: 0.00000
title: Mulliken charges with hydrogens summed into heavy atoms:
elementType: Br O O C C C C C C C C
charge: 0.016162 -0.014602 -0.211569 0.025701 0.031933 0.025312 0.153906 0.037599 -0.258360 -0.057131 0.251050
polarizability: 1.43932440e+02 -1.00100913e+01 1.03630305e+02 -1.26420235e+00 -2.22936773e+00 8.55055391e+01
1716.lowfreq: -12.0330 -8.5565 -0.0007 -0.0004 -0.0004 6.1932 27.2560 31.5699 45.9822
frequency: 25.8903 31.0666 45.9797 64.0313 86.8272 108.6106 131.9178 140.2871 148.1787 201.5848 224.8993 252.8391 277.3488 392.2231 418.4284 499.1350 528.1091 585.8412 645.7287 722.5976 734.1196 738.8865 770.4135 821.5585 888.5006 896.8222 985.1940 999.9466 1014.8725 1037.2290 1060.0844 1071.2506 1081.3092 1115.6692 1129.5297 1170.2457 1195.3205 1232.2367 1238.7953 1259.5818 1280.0963 1286.0370 1289.8085 1295.7447 1328.5897 1348.3630 1353.3269 1364.4719 1387.9945 1455.2050 1462.8870 1465.3059 1473.1577 1476.0012 1481.4564 1488.2748 1657.5312 2953.4335 2957.9550 2966.0563 2970.6865 2971.9194 2991.0798 3005.8415 3010.8947 3023.7347 3040.8039 3068.4034 3071.3103 3075.3498 3100.5645 3516.0662
redmass: 2.3954 2.3182 6.5517 5.7901 3.2090 1.6694 4.8106 3.2095 3.3759 6.3327 1.1178 3.3908 3.6326 4.1614 3.0956 3.4122 2.6685 3.5805 1.5310 1.0689 1.6189 2.5173 1.5214 1.7271 1.8875 1.3814 1.2795 3.9093 3.3592 3.1118 2.4209 1.8243 2.0725 2.2578 1.6331 1.4145 1.5950 1.3336 1.3512 1.3996 1.1222 1.1128 1.3342 1.0979 1.3856 1.4703 1.6538 1.7554 1.2159 1.0850 1.0653 1.0769 1.0743 1.0428 1.0806 1.0902 8.7482 1.0588 1.0591 1.0597 1.0601 1.0362 1.0970 1.0978 1.0624 1.1022 1.1042 1.1008 1.0993 1.1016 1.0896 1.0641
irintensity: 0.1143 0.0219 1.5479 0.8882 0.1494 0.0050 0.7107 0.1839 0.3757 1.4546 0.0110 2.2499 1.3998 6.5414 4.1992 25.5429 14.0566 9.6264 194.1815 14.2677 2.1682 1.2054 4.7238 1.5777 3.5594 0.3741 2.5716 19.2125 14.1963 230.7098 25.7104 5.6916 0.7219 17.3314 24.1537 8.6011 3.0651 8.7411 7.6567 5.4160 1.0579 2.7475 10.3977 1.7325 5.8868 0.7343 2.8590 30.9436 10.1559 5.8448 0.1498 1.2219 2.5705 12.6198 3.4205 24.1103 201.6076 1.5524 3.1667 5.0708 116.2739 44.9943 1.4547 0.0300 17.8282 3.9675 74.6841 84.1853 52.7186 31.7396 8.0762 34.1663
temp: 298.150 k
press: 1.00000 atm
elementType: 35 8 8 6 6 6 6 6 6 6 6 1 1 1 1 1 1 1 1 1 1 1 1 1 1 1
symmnumber: 1
zpe: 571763.8 jmol-1
zpe.correction: 0.217773 hartree
zpe.thermalcorrener: 0.231888 hartree
zpe.thermalcorrenthalpy: 0.232832 hartree
zpe.thermalcorrgfe: 0.173191 hartree
zpe.sumelectzpe: -476.867712 hartree
zpe.sumelectthermal: -476.853597 hartree
zpe.sumelectthermalent: -476.852653 hartree
zpe.sumelectthermalfe: -476.912294 hartree
dipole: -1.7619 0.7027 -1.4612
dipole: 2.3944
quadrupole: -79.8959 -72.4843 -81.4576
quadrupole: 5.2686 -0.3962 -2.1622
quadrupole: -1.9499 5.4616 -3.5117 5.2686 -0.3962 -2.1622
hfenergy: -477.0854849 hartree
pointgroup: C01[X(C8H15Br1O2)]
dipole: 0.6726895 0.3960478 0.5273392 debye
dipolederiv: -0.5333713 -0.1641093 0.0109991 -0.2653622 -0.3324619 0.0368395 -0.0417277 0.0064294 -0.1153662 -0.6380886 0.2952735 0.307712 0.3014751 -0.7248665 -0.4192803 0.271933 -0.3604457 -0.5699008 -0.4598416 0.1732901 0.087135 0.0273661 -0.5732856 0.2139881 0.3057223 0.0605432 -0.821142 0.0045299 -0.0340364 0.0038657 -0.1319112 0.0904591 -0.0418912 -0.0564243 -0.0556701 0.1533127 -0.0899832 -0.0124744 0.0328336 0.1738188 0.1333505 -0.0282574 0.1569902 -0.0074853 0.1643193 -0.0844634 -0.021659 0.024051 0.071091 0.1114136 -0.0448363 0.0792728 -0.0342683 0.153789 -0.2298317 -0.0664073 0.0296956 -0.1732236 -0.0204072 -0.027563 -0.059735 -0.038004 0.0744661 0.0346397 -0.0206441 0.0068602 -0.0953504 0.1069339 -0.029128 -0.0370382 -0.0380899 0.1549994 0.7806767 0.3367263 0.0531906 0.2912599 0.1156592 0.0752211 0.0531192 0.1434772 0.0865194 -0.08157 -0.0561089 -0.008747 -0.0109223 0.0575967 -0.0192693 0.0182247 -0.0133704 0.0862922 0.518416 -0.5645623 -0.4260739 -0.3550492 1.1904237 0.0212908 -0.6095366 0.0225073 1.1172633 0.024519 0.0228602 -0.0021739 0.0315852 -0.1578831 0.0663288 -0.0063755 0.090343 0.0344826 0.036843 -0.0061138 -0.01749 -0.0022558 0.0562936 -0.0270202 -0.0089893 -0.0489927 -0.1700025 0.0457645 -0.0063321 -0.0032546 -0.0056571 0.0602347 -0.0283985 -0.0104033 -0.0505238 -0.1733439 0.0729693 0.0235667 -0.0106705 0.0323007 -0.1288488 0.0473118 -0.0057313 0.0710985 0.0410432 0.0377545 0.0375904 -0.0089338 0.0237527 -0.1614067 0.0653654 -0.0116263 0.0892312 0.0351529 0.0378029 -0.0026117 -0.0057236 -0.0075182 0.0546782 -0.0295929 -0.0154878 -0.0559413 -0.1917108 0.0703544 -0.0156942 -0.0120473 -0.0071996 0.0951628 -0.0084433 -0.0005397 -0.0404527 -0.0796238 0.0563413 0.041523 -0.0191173 0.0375359 -0.0904838 0.0592011 0.0042336 0.0679379 0.0585089 0.0277745 -0.015878 -0.0472606 -0.0032248 0.0608911 -0.036754 -0.0088738 -0.0599332 -0.1917895 0.0287794 -0.0040279 0.003357 0.0312531 -0.1768462 0.0709121 -0.0079563 0.1009284 0.0405592 -0.0056639 -0.050389 -0.0394205 -0.041232 0.0138963 -0.0562069 -0.0027801 -0.0152684 -0.0292694 0.0820069 -0.0136739 0.002232 -0.0309903 0.0732931 -0.0210592 -0.0642048 -0.0459005 -0.1818625 -0.1937115 0.0560552 0.0721877 0.0873627 0.0465522 -0.043028 0.0907441 -0.0387103 0.0652371 0.0801861 0.0432749 -0.03125 -0.0258238 -0.1492711 0.0869729 -0.0157472 0.1000091 0.0454675 0.3771673 0.0245622 -0.0019564 0.0469194 0.248922 0.1172968 -0.017063 0.1505514 0.2125985 unknown
polarizability: 140.8455739|14.2808714|106.6947275|-4.2627919|0.09813|85.5279821 unknown
InChI: InChI=1S/C8H15BrO2/c1-2-3-4-5-6-7(9)8(10)11/h7,10H,2-6H2,1H3
charge 0 multiplicity 1
26 atoms
Br -3.649061 -1.743354 0.246388
O  -3.313736 1.666878 0.765477
O  -2.28917 1.240989 -1.279363
C  1.731071 -0.670264 -0.172474
C  0.407247 -0.073958 0.35929
C  2.96464 0.196724 0.164999
C  -0.807877 -0.970592 0.002552
C  4.287885 -0.399126 -0.367997
C  -2.116311 -0.409391 0.558668
C  5.518375 0.470538 -0.031543
C  -2.55964 0.88368 -0.113503
H  1.871655 -1.687733 0.248495
H  1.659131 -0.793374 -1.272733
H  0.475724 0.047218 1.460391
H  0.265377 0.937384 -0.07028
H  2.826333 1.214198 -0.256553
H  3.038096 0.322643 1.265671
H  -0.892006 -1.064789 -1.095251
H  -0.652121 -1.983441 0.417192
H  4.212929 -0.526301 -1.467291
H  4.425498 -1.415902 0.053713
H  -2.112903 -0.286141 1.652411
H  5.631531 0.591569 1.062497
H  6.450524 0.020374 -0.419676
H  5.422315 1.480964 -0.472042
H  -3.622904 2.48951 0.297166
