program: Gaussian 09
title: 000092135
version: EM64L-G09RevD.01
frameworkgroup: C1[X(C4H8O3)]
method: RPBEPBE
basis: SDD
operation: Freq
keyword: #p
keyword: freq=noraman
keyword: PBEPBE/SDD
title: #p freq=noraman PBEPBE/SDD
converged: YES YES NO NO
title: Mulliken charges:
elementType: O O O C C C C H H H H H H H H
charge: -0.458853 -0.412981 -0.242820 -0.026718 -0.472702 -0.695763 0.213149 0.222822 0.233536 0.264575 0.210586 0.231678 0.214279 0.343378 0.375833
chargesum: 0.00000
title: Mulliken charges with hydrogens summed into heavy atoms:
elementType: O O O C C C C
charge: -0.115475 -0.037148 -0.242820 0.196104 0.025409 -0.039220 0.213149
polarizability: 6.25790271e+01 -5.30333857e-01 4.98357180e+01 3.32394018e+00 3.29038528e+00 4.69037612e+01
1716.lowfreq: -10.9292 -0.0009 -0.0003 0.0005 3.1161 10.7563 47.6514 73.8245 157.9557
frequency: 47.6404 73.7601 157.9552 233.2040 268.8091 315.7624 359.1856 438.5926 457.7202 514.4303 598.1247 661.1378 821.9034 854.3064 893.0894 943.5752 1043.5485 1065.8422 1084.5705 1112.9728 1181.6693 1249.6986 1257.5655 1314.1649 1344.2958 1389.3224 1391.0828 1424.6878 1469.0162 1473.3840 1668.4759 2977.4194 2981.4401 3011.1962 3071.5758 3085.4820 3093.6704 3508.9098 3572.8622
redmass: 4.8534 3.9255 3.6329 1.0769 1.1588 3.0370 2.7214 2.9999 3.1041 2.1427 3.1797 1.5606 3.1909 3.1944 1.9609 1.9108 1.9185 2.4444 1.6013 2.3358 1.2001 1.4183 1.2646 1.5486 1.5501 1.3400 1.4998 1.0976 1.0713 1.0538 8.4566 1.0465 1.0742 1.0634 1.0987 1.0998 1.0972 1.0638 1.0663
irintensity: 3.9695 0.8134 10.2969 2.7018 144.8863 2.3067 5.0503 19.7380 10.5594 37.8686 34.3397 137.1364 22.0001 3.3992 16.5279 22.4180 122.1440 93.2905 93.8302 47.0762 11.0142 22.6590 15.6392 12.1525 30.7534 41.3892 27.9645 26.1962 10.5463 9.2872 219.3410 22.0483 24.2268 6.2695 37.2016 19.0034 20.8621 19.6284 5.4784
temp: 298.150 k
press: 1.00000 atm
elementType: 8 8 8 6 6 6 6 1 1 1 1 1 1 1 1
symmnumber: 1
zpe: 313493.7 jmol-1
zpe.correction: 0.119403 hartree
zpe.thermalcorrener: 0.127698 hartree
zpe.thermalcorrenthalpy: 0.128642 hartree
zpe.thermalcorrgfe: 0.086198 hartree
zpe.sumelectzpe: -382.322507 hartree
zpe.sumelectthermal: -382.314212 hartree
zpe.sumelectthermalent: -382.313268 hartree
zpe.sumelectthermalfe: -382.355712 hartree
dipole: 1.4764 -0.9263 0.5544
dipole: 1.8290
quadrupole: -33.2246 -40.9840 -46.9307
quadrupole: 2.7143 3.1874 -2.3734
quadrupole: 7.1552 -0.6042 -6.5510 2.7143 3.1874 -2.3734
hfenergy: -382.4419101 hartree
pointgroup: C01 [X(C4H8O3)]
dipole: -0.5841379 0.3314382 0.2583031 debye
dipolederiv: -0.4848316 0.1830264 -0.1244694 0.169329 -0.5593132 -0.2485808 -0.1157666 -0.2835248 -0.5965192 -0.8915648 -0.387476 0.4116993 -0.2821406 -0.4698071 0.1227228 0.3740501 0.1459234 -0.6379846 -0.6646448 0.1589739 -0.0769677 -0.0194929 -0.7214039 0.3423748 0.0967753 0.2856213 -0.5969997 0.510204 -0.0221332 0.045171 0.0271036 0.4892544 0.2225921 -0.0056243 0.2188006 0.4980415 -0.3301782 0.0492549 0.0059818 0.1318531 -0.1040638 0.0342313 0.0691077 0.0525118 0.0907305 -0.16412 0.123225 0.0474349 0.0531892 -0.0211739 -0.0502986 0.0020974 -0.0487448 0.0265886 1.3850249 0.0164112 -0.2850403 0.0178054 0.8964929 -0.5669435 -0.3893662 -0.5413843 0.7841042 0.0503089 0.028627 -0.0325743 0.0004646 -0.0504132 0.0748533 -0.0194703 0.0396674 -0.1300751 0.0713522 0.0153953 -0.0029373 0.0039567 0.0218605 -0.0818206 -0.0169744 -0.1120966 0.0057978 0.0682362 0.0073191 -0.0104947 -0.0042909 0.0807342 0.0623725 -0.0047446 0.0918619 -0.012375 0.0865266 0.0005668 -0.0189328 0.0260834 0.0077137 -0.1276519 0.0051724 -0.1298483 -0.0883932 0.0736153 0.0110287 0.0102883 0.0502753 0.0071267 0.0987994 -0.0446282 0.1282519 -0.0453767 -0.1042241 -0.0929738 0.016443 -0.145814 -0.0318398 0.0103728 0.012944 0.0087202 0.1017318 0.1863656 -0.1986625 0.0529595 -0.1762786 0.2081383 0.0288124 0.0936742 0.0545247 0.2652512 0.2079297 0.1074173 -0.0385614 0.1479568 0.2466941 0.078164 -0.0572463 0.0897155 0.3354779 unknown
polarizability: 62.6339459|-0.0357492|50.6255619|-3.2185016|-2.819492|46.0589984 unknown
InChI: InChI=1S/C4H8O3/c1-3(5)2-4(6)7/h3,5-6H,2H2,1H3
charge 0 multiplicity 1
15 atoms
O  -1.239731 -0.950401 -1.06198
O  2.27231 0.649176 -0.600987
O  1.496744 -0.913774 0.927297
C  -1.248479 -0.149474 0.183589
C  -0.050395 0.798668 0.030372
C  -2.579452 0.60243 0.350438
C  1.268943 0.065195 0.183556
H  -1.067456 -0.81151 1.056138
H  -0.090644 1.586067 0.807821
H  -0.085102 1.294641 -0.953572
H  -2.578528 1.214857 1.271666
H  -2.760804 1.265798 -0.514093
H  -3.425557 -0.106313 0.42037
H  -1.864427 -1.712296 -0.96427
H  3.125477 0.155137 -0.457646
