program: Gaussian 09
title: 000092124
version: EM64L-G09RevD.01
frameworkgroup: C1[X(C6H13NO2S)]
method: RPBEPBE
basis: SDD
operation: Freq
keyword: #p
keyword: freq=noraman
keyword: PBEPBE/SDD
title: #p freq=noraman PBEPBE/SDD
converged: YES YES NO NO
title: Mulliken charges:
elementType: S O O N C C C C C C H H H H H H H H H H H H H
charge: 0.131965 -0.426930 -0.234415 -0.606523 -0.395253 -0.105568 -0.666830 0.175370 -0.621032 -0.645213 0.217722 0.227490 0.258510 0.261568 0.271232 0.297001 0.273571 0.283964 0.249412 0.227497 0.229487 0.218400 0.378575
chargesum: 0.00000
title: Mulliken charges with hydrogens summed into heavy atoms:
elementType: S O O N C C C C C C
charge: 0.131965 -0.048355 -0.234415 -0.035951 0.049960 0.152942 -0.134030 0.175370 -0.087656 0.030170
polarizability: 1.15558031e+02 -8.83716084e+00 9.43441921e+01 -5.75455310e+00 -1.93141266e+00 7.70937484e+01
1716.lowfreq: -10.3006 0.0010 0.0023 0.0023 3.6692 16.8916 28.2520 41.2546 52.9418
frequency: 27.8882 40.1548 52.9085 78.8176 105.1737 133.4660 205.2486 223.9443 237.9756 276.3148 286.3020 298.8021 335.8797 401.1971 488.2279 520.7171 596.0465 601.5235 622.5691 625.9847 704.2841 742.2026 792.6845 835.8552 947.8806 979.0818 997.9145 1035.1389 1048.8991 1051.2289 1070.0416 1108.7743 1145.6448 1163.1618 1200.8135 1240.6842 1250.6129 1273.7377 1289.8793 1309.6341 1321.4557 1394.6320 1401.4347 1444.0085 1447.9587 1468.5897 1470.8675 1483.8125 1608.5308 1672.9927 2972.1231 2983.4438 3017.6089 3022.3382 3026.6341 3040.9924 3074.8635 3079.3240 3098.0440 3104.1551 3484.2483 3495.7035 3624.5334
redmass: 5.2378 4.7887 4.6405 2.0971 3.8276 5.5172 2.5629 1.5115 1.1312 2.2014 2.5249 2.8001 3.0743 3.6263 2.2726 1.9732 2.9036 1.6087 3.4488 3.6772 3.2407 2.5082 1.1005 2.0575 1.9036 2.1301 1.9827 1.2463 2.7528 3.2657 2.1060 1.5490 1.3112 1.4209 1.5170 1.2438 1.4552 1.3413 1.2839 1.1339 1.3830 1.2074 1.6745 1.0878 1.1034 1.0398 1.0846 1.0497 1.2616 4.1203 1.0608 1.0354 1.0582 1.0794 1.0688 1.0958 1.1014 1.0995 1.1064 1.1063 1.0446 1.0637 1.0996
irintensity: 0.7834 2.5259 1.9946 1.8788 0.6985 2.2756 1.6641 43.2203 0.2731 7.3132 7.9796 8.4336 3.5444 8.3124 61.2622 199.8690 11.1992 102.3100 23.2818 20.3527 62.9390 10.8687 9.1159 8.7319 13.3078 1.3888 15.2770 7.6379 225.2871 12.3277 9.9113 3.9378 1.4795 6.2991 11.0607 3.9354 4.3144 35.6687 1.3132 5.3861 11.4101 19.1040 6.4294 9.5184 15.2185 14.3479 3.7349 7.7269 148.3765 170.6733 27.8490 33.6677 18.8890 17.4330 10.7802 34.1465 16.2250 18.2612 12.0244 36.4149 7.2776 19.4086 9.9628
temp: 298.150 k
press: 1.00000 atm
elementType: 16 8 8 7 6 6 6 6 6 6 1 1 1 1 1 1 1 1 1 1 1 1 1
symmnumber: 1
zpe: 496962.2 jmol-1
zpe.correction: 0.189283 hartree
zpe.thermalcorrener: 0.202292 hartree
zpe.thermalcorrenthalpy: 0.203236 hartree
zpe.thermalcorrgfe: 0.148279 hartree
zpe.sumelectzpe: -838.870932 hartree
zpe.sumelectthermal: -838.857923 hartree
zpe.sumelectthermalent: -838.856979 hartree
zpe.sumelectthermalfe: -838.911936 hartree
dipole: -0.7985 0.4836 -1.4389
dipole: 1.7152
quadrupole: -77.8888 -61.3052 -68.9079
quadrupole: -9.0243 -1.2839 -3.2284
quadrupole: -8.5215 8.0621 0.4594 -9.0243 -1.2839 -3.2284
hfenergy: -839.0602147 hartree
pointgroup: C01 [X(C6H13N1O2S1)]
dipole: 0.3263921 0.2081618 0.5527156 debye
dipolederiv: -0.3789946 -0.120112 -0.0111868 -0.1139486 -0.1436 0.0719079 -0.001005 0.1116068 -0.1915704 -0.8075364 -0.366493 -0.0936356 -0.4750561 -0.6440208 -0.0170449 -0.172282 -0.0236903 -0.3579385 -1.0315636 0.0273775 -0.0173733 0.2381356 -0.5918011 -0.0834465 0.1579696 -0.113779 -0.3383544 -0.4968914 -0.0222805 -0.193823 -0.0656666 -0.4196103 0.1542906 -0.3443019 0.1478076 -0.8005305 -0.0021186 -0.0647179 -0.0774783 0.031293 0.0468135 0.0447988 0.0501419 -0.1041423 -0.050657 0.2621423 0.2083752 0.2131214 0.2238682 -0.0075805 0.0145043 0.2179258 -0.0226765 0.4254347 0.3518463 0.0262792 -0.1072762 0.0379015 -0.0030097 -0.0097139 -0.1776669 -0.056456 0.1010774 1.5334104 0.1610219 0.0144213 0.0322947 1.0928746 0.1992722 -0.1144517 0.3061422 0.2222991 0.1930317 0.2044655 0.0195018 0.2726356 0.2703997 -0.0803588 0.0606867 -0.0760897 0.1095317 -0.0382495 -0.0219918 0.0799993 -0.1500204 -0.0024407 0.0750257 0.0332638 -0.0194576 0.0088502 -0.1473327 -0.0382687 0.128667 0.0188602 0.0930591 -0.0031042 0.052932 0.0242226 -0.0217315 0.0763539 0.0400278 -0.0184875 0.0092372 -0.1253303 -0.0602483 -0.0656999 -0.0512717 0.0309308 0.0003371 -0.0758286 0.0687619 -0.0528563 0.0455647 0.0062811 0.0673637 0.0039444 0.0151506 -0.0594761 0.0055921 0.0022591 0.0187138 0.0283554 0.1089723 0.0169332 0.0993249 -0.1115465 -0.0018874 -0.0185542 0.0367239 -0.0213535 -0.055696 -0.097595 0.0602987 -0.0549634 0.0489399 0.1344365 -0.0331754 0.0314642 -0.0542924 0.2715475 -0.0696841 0.1528315 -0.0505373 0.2269163 0.1603298 0.0340034 -0.0199982 0.0125948 0.0496393 -0.1359461 0.0465055 -0.0205268 0.368633 -0.0060801 0.0349624 0.0011633 0.0272168 -0.0762351 0.0334613 -0.0129137 0.0216485 0.0565915 0.0113702 -0.0698369 -0.0334654 -0.0957214 -0.031869 -0.0435823 -0.0569571 -0.0576595 -0.1269412 -0.0378338 0.0927079 -0.0204153 0.172701 0.0103466 0.0147512 -0.0450369 0.0488544 0.0759222 0.0716054 -0.0173864 -0.1018153 0.0078506 0.0975098 -0.0758919 -0.0469007 -0.0296475 -0.1091258 0.0085898 -0.110414 0.047526 -0.1387489 -0.1161004 0.0272343 0.0571891 0.0201454 0.0857458 0.2045109 0.1242465 0.0513456 0.0643611 0.2111836 -0.0738838 0.0631743 -0.1027993 0.3323725 unknown
polarizability: 117.1237226|6.1707653|93.1788687|-5.7888714|1.1160606|76.6933805 unknown
InChI: InChI=1S/C6H13NO2S/c1-2-10-4-3-5(7)6(8)9/h5,8H,2-4,7H2,1H3
charge 0 multiplicity 1
23 atoms
S  2.161928 -1.374456 0.327654
O  -0.41296 1.733582 0.317008
O  -2.670194 1.202657 0.347612
N  -2.139938 -1.006001 -1.273833
C  -0.664647 -1.424617 0.768622
C  -1.049458 -0.491453 -0.437876
C  0.664564 -1.089342 1.470334
C  -1.493533 0.866111 0.091177
C  2.882548 0.386617 0.250856
C  3.996737 0.42506 -0.804787
H  -1.492177 -1.418382 1.50828
H  -0.607953 -2.451997 0.359515
H  -0.13746 -0.356034 -1.047433
H  0.808954 -1.735699 2.352161
H  0.70312 -0.036092 1.794826
H  -3.076793 -0.855802 -0.889988
H  -1.982028 -1.936219 -1.664791
H  2.056368 1.072725 0.000911
H  3.272724 0.635108 1.252932
H  4.805264 -0.288535 -0.564107
H  3.604634 0.175766 -1.806769
H  4.439175 1.437638 -0.851496
H  -0.759973 2.593263 0.68359
