program: Gaussian 09
title: 000092127
version: EM64L-G09RevD.01
frameworkgroup: C1[X(C3H7IO2)]
method: RPBEPBE
basis: SDD
operation: Freq
keyword: #pfreq=noraman
keyword: PBEPBE/SDD
title: #p freq=noraman PBEPBE/SDD
converged: YES YES NO NO
title: Mulliken charges:
elementType: I O O C C C H H H H H H H
charge: 0.053524 -0.439641 -0.475926 0.037148 -0.336229 -0.785632 0.238933 0.199489 0.209455 0.272385 0.298848 0.366177 0.361468
chargesum: 0.00000
title: Mulliken charges with hydrogens summed into heavy atoms:
elementType: I O O C C C
charge: 0.053524 -0.073464 -0.114457 0.276081 0.072716 -0.214399
polarizability: 9.29572733e+01 9.20891367e+00 4.68740397e+01 -5.82639519e+00 -3.29728034e+00 3.85656514e+01
1716.lowfreq: -19.1354 0.0005 0.0006 0.0007 7.0408 10.1633 66.3477 99.6607 147.8687
frequency: 66.3228 99.6498 147.8621 213.6526 246.4021 308.6861 433.8655 468.8709 510.3308 594.2267 799.1411 860.9353 966.3865 1004.3603 1027.5942 1054.0485 1147.1573 1173.4600 1212.1824 1226.4113 1259.8440 1330.3331 1378.7356 1393.7554 1424.3236 1458.9403 2957.4372 2975.9208 3024.6155 3058.7723 3147.3517 3524.2212 3597.3665
redmass: 5.2274 4.2330 3.5266 4.6082 1.0990 3.7559 2.4634 1.2297 2.4440 4.7759 1.9920 2.0507 7.5084 2.0728 1.7183 2.5978 1.2173 1.1437 1.1591 1.2594 1.1141 1.2644 1.3625 1.4493 1.1752 1.0806 1.0547 1.0846 1.1083 1.0562 1.1095 1.0648 1.0670
irintensity: 1.0238 4.4768 7.2989 4.4439 154.3685 6.3442 15.1665 123.0294 87.9129 29.7131 3.1579 16.1159 46.0148 42.9972 20.6817 88.0971 5.2851 17.1025 3.2163 27.7986 46.3329 28.4063 4.4369 4.6938 9.0344 5.2516 50.2882 22.0488 67.4340 15.3421 5.4439 21.4195 10.5914
temp: 298.150 k
press: 1.00000 atm
elementType: 53 8 8 6 6 6 1 1 1 1 1 1 1
symmnumber: 1
zpe: 263735.7 jmol-1
zpe.correction: 0.100452 hartree
zpe.thermalcorrener: 0.108218 hartree
zpe.thermalcorrenthalpy: 0.109162 hartree
zpe.thermalcorrgfe: 0.066306 hartree
zpe.sumelectzpe: -279.941555 hartree
zpe.sumelectthermal: -279.933788 hartree
zpe.sumelectthermalent: -279.932844 hartree
zpe.sumelectthermalfe: -279.975700 hartree
dipole: -4.0082 -2.8927 0.3044
dipole: 4.9524
quadrupole: -36.8345 -50.6633 -52.8755
quadrupole: 5.2954 -3.0838 -1.7857
quadrupole: 9.9566 -3.8722 -6.0844 5.2954 -3.0838 -1.7857
hfenergy: -280.0420065 hartree
pointgroup: C01[X(C3H7I1O2)]
dipole: 1.5711318 1.1122038 0.3014219 debye
dipolederiv: -0.3729603 -0.0430033 -0.0256475 -0.0798365 -0.0858116 -0.0138542 -0.0843391 -0.026344 -0.1030881 -0.3736172 -0.0193534 -0.1537003 0.0554639 -0.7996576 0.0733998 -0.1650357 0.0638208 -0.4870025 -0.8045221 0.2036516 0.1493686 0.236878 -0.4631923 0.1146953 0.1959855 0.0960787 -0.4932859 0.0942625 -0.0376607 0.0581633 -0.3272377 0.5532833 -0.1760701 -0.0812195 -0.1133044 0.334618 0.5330839 -0.2402552 -0.1152135 -0.0303092 0.2913177 -0.0055825 -0.0621324 -0.0324541 0.3663628 0.5984235 0.2029527 0.1542564 0.1751805 0.0499935 0.0462029 0.2149629 0.017574 0.0847717 0.0600752 -0.0080849 -0.0041351 0.0068788 -0.0142636 0.0127671 0.0044672 0.0517866 -0.1759397 0.0126201 0.0045979 0.0307111 0.0239687 -0.1919229 0.0677977 0.0259813 0.1088029 0.0189678 0.0158324 0.0354902 0.0203709 0.0540011 0.0372421 -0.0235036 0.0085949 -0.078793 -0.1893657 -0.0304664 -0.1035929 -0.027985 -0.0419116 -0.0919683 0.0129708 -0.0424963 0.0220063 0.0797509 -0.0467541 -0.0312369 -0.098342 -0.0552283 0.0936901 -0.0169201 -0.022138 -0.0295166 -0.0734902 0.1831455 0.1066622 0.0949883 0.080101 0.361177 0.0102962 0.0986535 0.0164505 0.3087781 0.1308769 -0.0701673 -0.0828352 -0.0979487 0.2601125 -0.1021993 -0.0912841 -0.0961077 0.3289229 unknown
polarizability: 91.652072|8.0359659|46.4006411|10.930876|4.2357867|40.3442514 unknown
InChI: InChI=1S/C3H7IO2/c4-1-3(6)2-5/h3,5-6H,1-2H2
charge 0 multiplicity 1
13 atoms
I  -3.022263 0.027201 -0.433546
O  0.095198 -1.319086 0.355539
O  2.473093 -0.171865 -0.341403
C  0.102069 0.025423 -0.216635
C  1.422218 0.733348 0.160754
C  -1.095591 0.780042 0.350843
H  0.045408 -0.021233 -1.324729
H  1.486716 1.727369 -0.327214
H  1.48913 0.846992 1.262953
H  -1.081479 1.845672 0.074887
H  -1.165007 0.650601 1.441216
H  0.963702 -1.734641 0.10777
H  3.361208 0.114978 -0.016233
