program: Gaussian 09
title: 000092093
version: EM64L-G09RevD.01
frameworkgroup: C1[X(C18H22N2)]
method: RPBEPBE
basis: SDD
operation: Freq
keyword: #pfreq=noraman
keyword: PBEPBE/SDD
title: #p freq=noraman PBEPBE/SDD
converged: YES YES NO NO
title: Mulliken charges:
elementType: N N C C C C C C C C C C C C C C C C C C H H H H H H H H H H H H H H H H H H H H H H
charge: -0.459171 -0.521815 -0.048989 -0.470664 -0.418873 -0.413513 -0.394640 -0.377156 0.481191 -0.433921 -0.379348 -0.439946 -0.406768 0.464087 0.456877 -0.449968 -0.389714 -0.197731 -0.217497 -0.274678 0.217230 0.217833 0.201223 0.189932 0.227870 0.185800 0.207775 0.200597 0.205987 0.192065 0.201809 0.282484 0.212796 0.231845 0.226945 0.261053 0.288929 0.216994 0.261703 0.219269 0.218283 0.223818
chargesum: 0.00000
title: Mulliken charges with hydrogens summed into heavy atoms:
elementType: N N C C C C C C C C C C C C C C C C C C
charge: -0.176687 -0.232886 0.168241 -0.051608 -0.001071 -0.019938 0.011943 0.016718 0.481191 -0.221125 -0.147504 -0.213001 -0.145715 0.464087 0.456877 -0.232974 -0.128010 0.021538 0.000786 -0.050859
polarizability: 3.62520003e+02 -1.67847590e+01 1.92956287e+02 -1.55567476e+00 1.15162794e+01 1.27851608e+02
1716.lowfreq: -3.4495 -0.0008 -0.0003 -0.0002 2.8609 15.4904 31.4443 39.7278 46.0203
frequency: 31.0670 38.9012 43.1484 68.3718 77.2608 100.5663 128.7367 178.7332 200.9561 213.1485 234.6748 296.3541 310.7516 330.6504 344.0389 371.2262 379.6779 406.9486 412.5240 442.6712 458.4458 463.0419 482.8073 503.0908 510.5707 567.6841 608.5594 614.6456 626.4473 656.0760 691.9629 707.2607 750.0639 773.0528 784.2857 795.8806 800.1563 810.3972 818.1950 826.4778 851.7170 863.0198 867.2156 879.5138 881.7831 920.3256 926.0112 939.5206 960.1058 977.3936 979.8667 992.7569 1006.6496 1009.8445 1023.8840 1046.6091 1058.0096 1085.4903 1090.0727 1113.1214 1124.7434 1150.8569 1165.2104 1168.3511 1186.0673 1191.5398 1227.0422 1243.3209 1260.1853 1268.3318 1270.2879 1277.6879 1304.6940 1315.3682 1325.2926 1331.7262 1332.6217 1338.0517 1355.8309 1356.0396 1360.6912 1373.7850 1383.6693 1425.0205 1434.9979 1455.1701 1461.8033 1465.7324 1469.8997 1472.2839 1483.2509 1488.3258 1515.3579 1520.8327 1583.0404 1593.2002 1619.0110 1643.6739 2955.9477 2959.3176 2964.5528 2972.9412 2977.1944 2987.0945 3026.3300 3029.1480 3037.0156 3041.0670 3047.4165 3104.7928 3107.0371 3124.1817 3130.5744 3136.1670 3141.4130 3157.7146 3163.8373 3170.1541 3541.9266 3566.0177
redmass: 3.9457 4.5577 4.3284 3.6645 3.4058 3.8633 4.8369 4.2332 2.5929 4.4309 2.9462 2.8921 4.0907 2.7885 1.1412 1.8680 2.8048 2.9445 3.0546 2.4909 1.5825 3.0937 2.2352 2.5938 2.4384 4.9368 4.9093 4.6795 4.5047 3.8525 1.9752 3.6388 1.7567 1.5483 2.9256 3.1084 1.3892 2.2559 2.3192 1.3083 2.4611 1.9178 4.7578 2.0901 1.5455 1.3623 1.4039 1.3395 1.3539 1.3404 4.8709 2.8678 2.0002 2.7466 2.1414 1.4972 1.7543 1.5685 1.7477 1.0908 1.3319 1.8060 2.0758 1.0571 1.1084 1.1393 2.6343 1.3308 1.2729 1.3920 1.3899 1.5911 1.6752 1.7315 1.3958 1.4258 1.4992 1.4527 1.4224 1.6290 1.4335 3.1174 4.8409 3.5632 2.2083 1.1005 1.1139 1.2499 1.3090 1.1391 1.2990 1.8858 1.9923 3.3264 5.4860 3.9269 6.2515 6.6832 1.0783 1.0667 1.0614 1.0644 1.0627 1.0665 1.0938 1.0983 1.0979 1.1026 1.1028 1.0865 1.0873 1.0862 1.0965 1.0930 1.0871 1.0949 1.0969 1.0977 1.0753 1.0761
irintensity: 1.1123 0.2406 1.0667 0.3322 1.2050 0.0913 1.8155 1.4619 0.4339 3.8320 3.1463 5.0071 0.5360 9.7842 71.9356 7.2306 25.1430 2.7786 1.3532 19.0600 125.7089 1.7381 2.6528 11.3632 8.9911 6.8888 3.9743 6.2858 0.7860 4.4934 41.5764 3.1802 81.1842 2.9868 23.0023 1.6445 1.0625 33.3591 37.1123 9.1022 1.8887 7.6391 3.8332 4.2067 6.8561 0.4392 11.8900 0.8465 0.4561 0.6865 8.7316 1.2922 12.2563 2.1666 11.0718 1.6539 1.0889 10.0572 0.8483 1.3252 12.7932 4.4588 16.8694 1.8297 2.4711 18.7854 5.1953 5.9156 3.3556 24.7513 14.2692 36.7547 41.0285 205.0290 1.2491 2.8007 1.2931 0.1057 3.3350 3.9325 9.9741 27.3402 65.8677 4.4899 56.5933 11.2785 9.1790 19.7356 15.7398 31.4036 62.1884 86.0733 50.6522 912.1221 1.1469 18.1125 247.3127 53.9017 11.2610 26.4478 44.8801 28.2836 28.9537 61.7120 101.1164 61.3365 19.9002 5.4427 144.1091 29.4061 14.3214 3.6282 24.9163 32.2478 37.4039 31.1372 9.6583 10.2050 16.6607 46.0027
temp: 298.150 k
press: 1.00000 atm
elementType: 7 7 6 6 6 6 6 6 6 6 6 6 6 6 6 6 6 6 6 6 1 1 1 1 1 1 1 1 1 1 1 1 1 1 1 1 1 1 1 1 1 1
symmnumber: 1
zpe: 942760.6 jmol-1
zpe.correction: 0.359079 hartree
zpe.thermalcorrener: 0.376849 hartree
zpe.thermalcorrenthalpy: 0.377793 hartree
zpe.thermalcorrgfe: 0.312557 hartree
zpe.sumelectzpe: -807.163536 hartree
zpe.sumelectthermal: -807.145765 hartree
zpe.sumelectthermalent: -807.144821 hartree
zpe.sumelectthermalfe: -807.210057 hartree
dipole: 3.3915 -0.9717 -0.0490
dipole: 3.5283
quadrupole: -108.4643 -110.0854 -124.5703
quadrupole: 4.1832 -0.2030 4.5751
quadrupole: 5.9091 4.2879 -10.1970 4.1832 -0.2030 4.5751
hfenergy: -807.5226145 hartree
pointgroup: C01 [X(C18H22N2)]
dipole: -1.3385199 -0.3664381 0.0311939 debye
polarizability: 362.8704397|14.7663404|192.0118176|-2.6029195|-13.0584086|128.4456409 unknown
InChI: InChI=1S/C18H22N2/c1-3-7-15(8-4-1)19-17-11-13-18(14-12-17)20-16-9-5-2-6-10-16/h1,3-4,7-8,11-14,16,19-20H,2,5-6,9-10H2
charge 0 multiplicity 1
42 atoms
N  -2.883385 -0.727924 -0.177699
N  2.783804 -1.251527 0.165449
C  -3.638676 0.292015 -0.923715
C  -5.079636 -0.21881 -1.185914
C  -3.683481 1.664796 -0.184462
C  -5.936528 -0.281369 0.103332
C  -4.52637 1.595882 1.109956
C  -5.960742 1.087043 0.826432
C  -1.48928 -0.802594 -0.092845
C  -0.881272 -1.822965 0.69909
C  -0.623556 0.092088 -0.789146
C  0.51589 -1.931735 0.798812
C  0.777545 -0.041364 -0.710998
C  1.376423 -1.047131 0.091546
C  3.822922 -0.306573 0.075411
C  5.152406 -0.779732 -0.13936
C  3.618237 1.095964 0.22987
C  6.235891 0.117841 -0.200073
C  4.712416 1.983369 0.15827
C  6.027997 1.511131 -0.059824
H  -3.142133 0.434699 -1.906361
H  -5.037078 -1.209564 -1.678513
H  -5.564839 0.477431 -1.897827
H  -4.118037 2.419058 -0.873162
H  -2.653661 1.993914 0.049749
H  -5.542022 -1.053594 0.7975
H  -6.965284 -0.599596 -0.153131
H  -4.561759 2.593097 1.588978
H  -4.027877 0.914774 1.829062
H  -6.489064 1.824062 0.186189
H  -6.535745 1.011639 1.76957
H  -3.41988 -1.411245 0.355557
H  -1.51701 -2.529356 1.248663
H  -1.039003 0.885952 -1.417365
H  0.950536 -2.711097 1.437417
H  1.407934 0.629022 -1.303039
H  3.081012 -2.219478 0.29668
H  5.326637 -1.85676 -0.263548
H  2.61678 1.482909 0.437216
H  7.247001 -0.272345 -0.365319
H  4.532803 3.057569 0.285678
H  6.869886 2.208904 -0.115522
