program: Gaussian 09
title: 000092052
version: EM64L-G09RevD.01
frameworkgroup: C1[X(C7H5Cl2NO3)]
method: RPBEPBE
basis: SDD
operation: Freq
keyword: #p
keyword: freq=noraman
keyword: PBEPBE/SDD
title: #p freq=noraman PBEPBE/SDD
converged: NO YES NO NO
title: Mulliken charges:
elementType: Cl Cl O O O N C C C C C C C H H H H H
charge: 0.004982 0.005084 -0.406648 -0.213263 -0.188609 -0.084529 -0.484145 -0.124401 -0.123764 -0.240208 -0.240460 0.379710 0.209288 0.282628 0.283227 0.272370 0.272753 0.395984
chargesum: 0.00000
title: Mulliken charges with hydrogens summed into heavy atoms:
elementType: Cl Cl O O O N C C C C C C C
charge: 0.004982 0.005084 -0.010663 -0.213263 -0.188609 -0.084529 0.081710 0.147969 0.148989 -0.240208 -0.240460 0.379710 0.209288
polarizability: 1.49977865e+02 -1.22392157e-01 1.22638367e+02 1.64575934e+01 5.27298128e-02 6.27507710e+01
1716.lowfreq: -4.8426 -3.2605 -0.0023 -0.0012 0.0008 5.6254 18.2139 36.3396 55.3630
frequency: 18.1443 36.3353 55.3627 77.3626 172.6143 202.4011 218.2154 221.4598 298.4753 299.3919 322.1325 348.0218 420.4410 450.3103 484.9491 510.9176 525.3819 588.8143 631.4352 632.5129 752.3251 763.9255 811.6878 835.5292 838.5926 858.4019 927.0260 974.3245 1042.4429 1077.6135 1121.0935 1207.5899 1225.0566 1259.7981 1338.5459 1350.2141 1356.2325 1431.1298 1450.7250 1556.6196 1564.3944 1633.5492 1692.7645 3030.7117 3090.3616 3181.6453 3186.8222 3526.7083
redmass: 13.0198 6.7421 9.6713 18.6415 19.4532 11.0160 4.7900 5.1239 5.7162 7.0692 7.9790 17.8012 4.0461 4.6699 2.0969 4.2810 4.8778 5.1508 1.7279 3.7898 11.7879 10.5280 5.1527 1.4066 3.7379 1.4999 6.9653 2.3094 2.5909 3.8473 3.3628 1.1670 2.5513 1.6236 1.7078 1.6554 2.3741 4.2080 1.1029 7.9171 10.3762 6.4993 9.2466 1.0609 1.1022 1.0934 1.0961 1.0645
irintensity: 1.3039 0.2612 1.0528 1.9569 0.0925 1.3040 0.2319 1.0893 0.3181 0.9278 2.3996 0.5128 0.0947 0.0019 30.3492 8.5182 72.8057 0.3414 120.9138 44.3207 12.8288 88.4913 17.4608 0.0049 7.1965 35.9240 2.4964 16.7834 377.5033 7.6027 31.4739 0.3797 167.1220 32.9563 32.1644 25.4046 11.1131 18.3123 34.5499 1.3177 142.1509 136.0035 199.0644 16.0566 0.2398 0.0929 0.0485 45.3624
temp: 298.150 k
press: 1.00000 atm
elementType: 17 17 8 8 8 7 6 6 6 6 6 6 6 1 1 1 1 1
symmnumber: 1
zpe: 296676.9 jmol-1
zpe.correction: 0.112998 hartree
zpe.thermalcorrener: 0.125413 hartree
zpe.thermalcorrenthalpy: 0.126357 hartree
zpe.thermalcorrgfe: 0.071187 hartree
zpe.sumelectzpe: -1469.320567 hartree
zpe.sumelectthermal: -1469.308153 hartree
zpe.sumelectthermalent: -1469.307209 hartree
zpe.sumelectthermalfe: -1469.362378 hartree
dipole: -9.4678 -0.0487 -3.0323
dipole: 9.9416
quadrupole: -88.6829 -86.2916 -90.1780
quadrupole: -0.0472 -0.9358 0.1022
quadrupole: -0.2988 2.0926 -1.7939 -0.0472 -0.9358 0.1022
hfenergy: -1469.4335656 hartree
pointgroup: C01 [X(C7H5Cl2N1O3)]
dipole: 3.7271405 0.0409871 -1.1854308 debye
dipolederiv: -0.1556724 0.2092231 0.0273088 0.2625696 -0.6461046 -0.0578176 0.0340357 -0.050921 -0.0321035 -0.1472646 -0.2004367 0.0222185 -0.2542964 -0.6563165 0.0457561 0.0278471 0.0387556 -0.0301603 -1.4822265 0.003144 0.2806023 0.0092361 -0.4171722 -0.0021687 0.0845904 -0.0017866 -0.3049079 -1.1284878 -0.0093342 0.1626937 -0.009834 -0.2753972 0.0024243 0.18693 0.0026767 -0.3681617 -0.7354647 0.0013681 0.0160026 0.0035784 -0.2641674 0.0029864 0.1694507 0.0002784 -0.8417865 -1.1016389 -0.0048652 0.1388968 -0.0082554 -0.5842844 -0.0027236 0.3195248 -0.0004071 -0.1936657 0.8175107 0.0085329 -0.0849127 0.013791 0.1382153 0.0049612 -0.3461022 0.0019024 -0.0371218 0.4496788 -0.1749187 -0.0896567 -0.4101454 0.1656167 0.06864 -0.0957464 0.0533391 0.0006701 0.4352092 0.1810807 -0.0846144 0.4161818 0.1774692 -0.0664514 -0.0864463 -0.0516031 -0.0017779 -0.1976457 -0.3309194 -0.0099389 -0.7610842 0.7977491 0.1618212 -0.0046138 0.0883129 -0.1187308 -0.2153871 0.3125201 -0.000704 0.7419919 0.8220139 -0.1430091 0.0115708 -0.0689594 -0.1231413 1.245901 0.0131424 -0.2126829 0.0141476 0.0203733 -0.0045902 -0.2386115 -0.00499 0.2807126 1.727691 -0.0097561 -0.1580388 -0.0182172 0.1962106 -0.0055006 -0.0701104 -0.0029665 1.1397404 0.0194623 -0.0090456 -0.020088 -0.0723695 0.0190001 0.0835443 0.0040794 0.0324297 0.0939203 0.0166838 0.0104747 -0.0165194 0.0716842 0.0253859 -0.0873392 0.007135 -0.0356705 0.0886609 0.0554856 -0.0659797 0.0353219 -0.0493779 0.0417647 0.0050177 0.031431 0.0119375 0.1608868 0.0536652 0.0653049 0.0367649 0.0489161 0.0440812 -0.0067051 0.0331386 -0.0136981 0.1605896 0.3425001 0.0004644 -0.0426536 0.0014833 0.3955623 0.0011543 -0.0681028 0.0013698 0.1263767 unknown
polarizability: 150.0417234|0.1136344|122.6338674|-16.288066|0.5016024|62.6914122 unknown
InChI: InChI=1S/C7H5Cl2NO3/c8-4-1-10(3-6(11)12)2-5(9)7(4)13/h1-2,11H,3H2
charge 0 multiplicity 1
18 atoms
Cl -2.20127 2.796982 0.131292
Cl -2.149447 -2.828147 0.074305
O  4.303675 0.005193 -0.030459
O  -3.41269 -0.029941 0.394718
O  2.572366 0.013143 1.534295
N  0.65557 0.017842 -0.613025
C  2.091309 0.033057 -0.910149
C  -0.033035 1.212088 -0.415037
C  -0.010864 -1.192745 -0.439168
C  -1.371556 1.210497 -0.085953
C  -1.349077 -1.222618 -0.110288
C  -2.179244 -0.015568 0.10157
C  2.961643 0.015623 0.354797
H  2.349589 0.931604 -1.49708
H  2.362536 -0.83673 -1.533129
H  0.534749 2.136776 -0.536871
H  0.573895 -2.104053 -0.580172
H  4.893252 -0.002004 0.771255
