program: Gaussian 09
title: 000092065
version: EM64L-G09RevD.01
frameworkgroup: C1[X(C15H28O2)]
method: RPBEPBE
basis: SDD
operation: Freq
keyword: #pfreq=noraman
keyword: PBEPBE/SDD
title: #p freq=noraman PBEPBE/SDD
converged: YES YES NO NO
title: Mulliken charges:
elementType: O O C C C C C C C C C C C C C C C H H H H H H H H H H H H H H H H H H H H H H H H H H H H
charge: -0.223391 -0.233804 -0.384010 -0.377390 -0.372501 -0.380571 -0.379385 -0.388899 -0.459023 -0.311538 -0.202385 -0.449538 -0.346813 -0.196706 -0.345865 -0.694243 0.010690 0.193796 0.195953 0.196124 0.196065 0.190895 0.194792 0.196515 0.196270 0.195092 0.210648 0.215701 0.215842 0.204764 0.195154 0.234982 0.235280 0.224539 0.191829 0.202401 0.204672 0.188474 0.223462 0.192154 0.195745 0.209471 0.210842 0.215324 0.208586
chargesum: 0.00000
title: Mulliken charges with hydrogens summed into heavy atoms:
elementType: O O C C C C C C C C C C C C C C C
charge: -0.223391 -0.233804 0.005739 0.014799 0.013186 0.012214 0.026355 0.042644 -0.059105 0.158724 0.022154 -0.055308 0.046333 0.026756 0.042035 -0.058606 0.219276
polarizability: 2.52082327e+02 -2.25554182e+00 1.43017149e+02 7.77666178e+00 2.44973224e+00 1.32554504e+02
1716.lowfreq: -33.6594 -13.4520 -1.7141 -0.0015 0.0008 0.0019 3.3953 11.9632 20.3308
frequency: -24.2882 10.4997 19.4603 21.2435 43.4239 47.8272 55.9903 68.0197 72.5162 95.1762 99.1217 109.4146 111.4085 135.7685 146.2384 167.0096 179.7559 212.2348 230.5088 264.7602 285.4303 302.7754 335.5190 355.5963 382.0314 433.7695 465.3346 501.7505 537.8849 719.1429 724.0480 727.8364 732.4083 744.8560 760.1643 783.9821 805.6788 847.5525 855.4168 887.9298 916.0791 918.8016 960.4665 972.7823 978.6499 985.0868 1001.7700 1006.0346 1020.8308 1037.8738 1055.8307 1067.7311 1070.5170 1074.1530 1079.7707 1099.7481 1100.5710 1106.2938 1110.1007 1150.1469 1164.9807 1198.6158 1204.0921 1210.5195 1233.7313 1243.1452 1244.9915 1263.2788 1265.2099 1277.0340 1278.0296 1279.1270 1284.3758 1290.4895 1292.5834 1297.7815 1299.6410 1312.1015 1329.5194 1338.8636 1342.9770 1347.6004 1351.3519 1356.0202 1370.2068 1386.6029 1456.2518 1456.9711 1459.8359 1461.1112 1464.5348 1465.7954 1467.9575 1474.8230 1475.3770 1477.0423 1482.2912 1486.1104 1487.7633 1621.9328 1685.0611 2945.9121 2947.3385 2950.0586 2952.0787 2955.4225 2959.0421 2962.2674 2966.8919 2967.6349 2971.0926 2985.1401 2990.5704 2993.2650 2997.6072 3003.0213 3003.3023 3010.5508 3012.3829 3029.1269 3036.4866 3036.7847 3041.6483 3048.2435 3058.0712 3067.4455 3069.0337 3069.9787 3078.1077
redmass: 2.4668 3.0547 4.0265 4.7132 2.7385 3.9401 2.8651 2.1425 2.5923 2.5355 2.4453 3.1600 2.3478 2.0874 2.0669 3.6334 3.3840 3.3166 1.1078 3.4666 2.1455 3.9811 2.4657 3.2211 3.3701 3.2881 3.2863 3.3825 2.6158 1.0636 1.0823 1.0868 7.4525 1.1519 1.2566 1.1777 1.3741 1.3329 6.6502 1.7883 1.3779 1.3125 1.6061 1.0918 1.6792 4.8881 3.2989 1.9902 1.9816 3.6976 1.9448 1.7700 2.3961 2.7415 2.1362 2.2673 5.6018 2.8775 2.8233 1.4588 2.0360 1.5193 1.3338 1.3675 1.3342 1.2895 1.2910 1.2411 1.1801 1.1481 1.2027 1.0910 1.0857 1.1175 1.1138 1.2166 1.2315 1.3476 1.3570 1.2419 1.4141 1.5711 1.5692 1.6229 1.4918 1.2140 1.0848 1.0827 1.0745 1.0736 1.0723 1.0737 1.0899 1.0949 1.0696 1.0465 1.0983 1.0775 1.0990 8.5573 6.6519 1.0619 1.0611 1.0593 1.0590 1.0593 1.0590 1.0599 1.0599 1.0607 1.0362 1.0965 1.0598 1.0984 1.0956 1.0976 1.0571 1.0993 1.1019 1.1041 1.0914 1.1031 1.1038 1.1044 1.0942 1.0957 1.0927 1.0993 1.1082
irintensity: 0.2671 0.0221 0.1968 1.0526 0.1451 0.3547 0.1465 0.0076 0.1215 0.1862 0.3192 0.8122 0.3031 0.0303 0.1290 0.6805 1.2004 0.6806 0.0344 6.0082 1.3552 2.3361 29.0064 2.9348 0.5838 0.3348 3.6707 3.3958 0.0932 13.1433 9.0283 0.3919 3.3775 4.5171 0.3954 0.9034 0.1085 0.8649 15.2344 4.0970 5.2299 1.3601 3.3039 55.0838 1.1838 1.4045 1.2352 1.8022 2.5821 0.1138 1.5962 14.8203 2.7795 33.1098 0.9992 5.4586 284.7320 42.1201 29.5019 2.0075 0.6842 1.5656 8.6121 4.9819 0.1653 0.8173 0.8111 0.2233 0.0704 0.3316 0.6988 0.0358 0.1250 0.1913 0.1917 0.2567 1.7256 0.5631 4.3979 4.6599 2.8518 0.4798 0.2528 0.5800 11.1946 11.3227 4.1255 0.3290 0.1485 0.6888 0.5538 0.2485 0.8488 4.2875 6.4206 11.6782 2.5342 16.1230 31.3260 297.3977 0.0041 31.4176 5.7770 9.5534 0.5128 1.1639 0.5030 10.2254 102.6363 137.8858 45.0313 1.0442 20.6744 3.0822 6.2596 4.9171 33.5186 1.3263 2.2929 4.9841 64.0536 49.7868 86.7563 74.8023 0.5071 17.6376 165.4593 56.8879 76.4305
temp: 298.150 k
press: 1.00000 atm
elementType: 8 8 6 6 6 6 6 6 6 6 6 6 6 6 6 6 6 1 1 1 1 1 1 1 1 1 1 1 1 1 1 1 1 1 1 1 1 1 1 1 1 1 1 1 1
symmnumber: 1
zpe: 1046654.4 jmol-1
zpe.correction: 0.398650 hartree
zpe.thermalcorrener: 0.420116 hartree
zpe.thermalcorrenthalpy: 0.421061 hartree
zpe.thermalcorrgfe: 0.342808 hartree
zpe.sumelectzpe: -737.426415 hartree
zpe.sumelectthermal: -737.404948 hartree
zpe.sumelectthermalent: -737.404004 hartree
zpe.sumelectthermalfe: -737.482256 hartree
dipole: -2.2546 -1.2591 -0.0794
dipole: 2.5836
quadrupole: -135.1069 -112.7824 -103.8974
quadrupole: -16.2940 -0.5099 0.1337
quadrupole: -17.8446 4.4798 13.3648 -16.2940 -0.5099 0.1337
hfenergy: -737.8250647 hartree
pointgroup: C01 [X(C15H28O2)]
dipole: -0.8887676 -0.4829736 -0.1001407 debye
polarizability: 252.030096|-3.7316568|142.1851262|7.606501|3.7404327|133.438758 unknown
InChI: InChI=1S/C15H28O2/c1-2-3-4-5-6-7-8-9-10-11-12-13-14-17-15-16/h5-6,15H,2-4,7-14H2,1H3
charge 0 multiplicity 1
45 atoms
O  7.616738 -0.552729 -0.288765
O  9.046625 1.247552 0.165202
C  1.304397 0.096267 0.245094
C  2.613946 -0.665806 -0.058407
C  0.038035 -0.765996 0.04404
C  3.88036 0.196839 0.142055
C  -1.272375 -0.00585 0.348013
C  5.183369 -0.578247 -0.166052
C  -2.538797 -0.879301 0.138691
C  6.420987 0.293828 0.036841
C  -3.82166 -0.158744 0.497769
C  -6.130446 0.815842 -0.001256
C  -7.40227 -0.037519 -0.255004
C  -4.848564 0.091763 -0.356473
C  -8.710317 0.731787 0.039053
C  -9.976393 -0.112991 -0.219589
C  8.85113 0.063995 -0.177834
H  1.330858 0.469997 1.290162
H  1.243287 0.994358 -0.404441
H  2.58691 -1.039436 -1.103232
H  2.674742 -1.563312 0.591768
H  0.098306 -1.664889 0.693202
H  0.010634 -1.139477 -1.001148
H  3.817473 1.093999 -0.508304
H  3.906174 0.569609 1.187179
H  -1.250728 0.361316 1.395258
H  -1.342482 0.893267 -0.296539
H  5.164504 -0.945325 -1.210234
H  5.25429 -1.468897 0.487442
H  -2.583036 -1.219622 -0.915074
H  -2.436128 -1.792861 0.763358
H  6.522146 0.647587 1.079534
H  6.430194 1.175897 -0.62993
H  -3.902463 0.193544 1.539837
H  -6.212597 1.745263 -0.605572
H  -6.101223 1.13112 1.060782
H  -7.358312 -0.952183 0.36985
H  -7.408667 -0.380489 -1.310761
H  -4.76696 -0.260808 -1.398504
H  -8.740717 1.648185 -0.585684
H  -8.701729 1.075383 1.093724
H  -10.023872 -0.442744 -1.274776
H  -9.984746 -1.019696 0.414466
H  -10.897223 0.45932 -0.002683
H  9.635298 -0.669798 -0.445058
