program: Gaussian 09
title: 000009607
version: EM64L-G09RevD.01
frameworkgroup: C1[X(C14H25FO3)]
method: RPBEPBE
basis: SDD
operation: Freq
keyword: #p
keyword: freq=noraman
keyword: PBEPBE/SDD
title: #p freq=noraman PBEPBE/SDD
converged: YES YES NO NO
title: Mulliken charges:
elementType: F O O O C C C C C C C C C C C C C C H H H H H H H H H H H H H H H H H H H H H H H H H
charge: -0.246506 -0.191541 -0.253052 -0.249824 -0.385762 -0.381658 -0.372613 -0.372397 -0.378445 -0.382406 -0.512180 -0.398794 0.199479 -0.215846 -0.605595 0.273988 -0.231189 -0.670487 0.196300 0.197635 0.194309 0.192854 0.196335 0.187661 0.197270 0.197591 0.215080 0.216136 0.194528 0.194815 0.287232 0.227968 0.216547 0.216553 0.193813 0.193546 0.241082 0.275550 0.230247 0.232646 0.235027 0.230816 0.213289
chargesum: 0.00000
title: Mulliken charges with hydrogens summed into heavy atoms:
elementType: F O O O C C C C C C C C C C C C C C
charge: -0.246506 -0.191541 -0.253052 -0.249824 0.008173 0.005505 0.011383 0.022463 0.052770 0.006937 0.003020 0.034307 0.199479 0.171513 -0.088962 0.273988 0.231703 0.008645
polarizability: 2.17108657e+02 6.18811620e+00 1.43275957e+02 -4.35780898e+00 5.63045282e+00 1.34199030e+02
1716.lowfreq: -4.3955 -3.9098 -0.0012 -0.0009 0.0011 2.1373 11.3573 16.8035 25.8329
frequency: 11.3152 15.8050 25.7515 31.2470 36.3401 51.8974 56.1044 66.7659 76.5954 88.8777 107.6512 113.0195 129.8372 138.2775 145.5975 155.2766 156.7765 173.1546 211.3344 252.6949 256.8367 302.7052 343.7241 360.0018 397.0831 423.5618 463.7232 475.7653 495.7372 546.9113 621.8121 694.7766 721.1513 728.2351 748.2755 777.6135 794.9741 799.3722 816.2198 834.4744 873.5751 906.1653 928.0389 933.0291 949.5282 991.4599 1000.8110 1011.8039 1020.0185 1037.5454 1051.7616 1063.8522 1079.7281 1081.6276 1083.4949 1100.0822 1108.1808 1114.9514 1132.7074 1134.6412 1147.9518 1190.8400 1205.0187 1210.4366 1229.7752 1246.6652 1249.0688 1259.1323 1272.6950 1278.2143 1283.1162 1283.4530 1286.4893 1295.6501 1296.7831 1315.4968 1343.2560 1356.0677 1357.0662 1358.6533 1364.5725 1383.8362 1401.1018 1430.2103 1438.2201 1460.6480 1461.9629 1463.0915 1464.9147 1469.3201 1471.3411 1473.2166 1476.9463 1484.5782 1485.9486 1489.7265 1617.9829 1640.0977 2950.2611 2951.3974 2952.1579 2954.5399 2959.1407 2966.2598 2985.4988 2990.7934 2991.7793 2992.2884 2996.7512 2997.5415 3000.1706 3001.7417 3012.5327 3013.1049 3020.2231 3036.7675 3047.6285 3054.4409 3072.1217 3078.0408 3094.2736 3110.1571 3122.1210
redmass: 4.7650 3.7475 3.1971 2.7591 4.4706 2.6587 4.0732 2.0866 3.7152 4.2263 2.0011 2.6801 3.0836 3.2983 1.9483 2.3922 4.2734 2.3964 3.6693 1.7817 2.6225 5.9975 3.8166 3.4509 2.9383 3.3006 3.1528 3.1269 3.1981 4.3071 3.9329 2.2445 1.0868 1.1908 1.2762 1.3628 2.4282 1.1368 1.7193 2.4378 1.4747 2.1955 7.9532 3.2903 1.3441 4.6720 4.8666 1.1710 2.2762 3.7297 3.3839 2.3800 2.2809 2.1103 2.3948 1.5550 3.5812 2.2511 3.0052 1.4804 1.3136 1.6102 1.3860 1.3796 1.4092 1.3175 1.1476 1.2990 1.2461 1.2064 1.1041 1.3536 1.1332 1.1098 1.1109 1.3853 1.4601 1.4011 1.6999 1.5552 1.7449 1.3121 1.2604 1.0916 1.0962 1.0748 1.0736 1.0400 1.0723 1.0864 1.0882 1.0646 1.0959 1.0992 1.0659 1.1000 9.4778 8.4313 1.0601 1.0598 1.0606 1.0589 1.0596 1.0588 1.0966 1.0617 1.0969 1.0595 1.0941 1.0360 1.0561 1.1015 1.0584 1.0632 1.1043 1.1046 1.1052 1.1034 1.1068 1.1102 1.0985 1.1028 1.0986
irintensity: 0.1852 0.8209 3.2085 0.1276 1.3674 0.7794 1.0744 0.8559 3.9147 3.7286 0.0253 1.5537 1.9994 0.9191 0.0278 2.4116 0.7713 3.4351 6.9289 4.8168 9.9259 1.5101 8.8377 6.7145 0.4949 1.6295 2.3974 2.3770 10.7206 7.6961 8.1101 4.3784 14.2009 0.9019 5.0412 2.3996 4.5943 5.0140 5.6827 1.3691 4.5899 18.3645 65.4039 3.2431 1.7755 0.5122 15.8970 0.3638 62.9686 9.3150 5.8704 46.5906 9.4389 1.8653 69.8094 7.9192 29.8925 3.4033 388.8953 11.8591 1.1071 11.7462 68.3213 16.4143 9.8233 11.4936 0.0631 6.3938 65.6936 70.9735 6.1524 15.1936 20.5750 0.1805 1.2207 6.6742 13.2529 2.7724 0.2334 4.6748 24.2965 16.3140 22.1117 24.0875 32.6207 0.0955 0.4441 12.2430 0.2225 0.8376 0.0076 4.7274 2.5443 4.8032 15.0292 27.4878 241.6421 69.6253 2.1157 2.8276 8.7522 7.3807 3.6867 131.1030 1.5271 32.0956 0.7111 3.2558 1.6478 20.2566 89.0877 4.9343 14.9675 4.9396 0.0927 68.8371 15.5560 101.5403 7.3823 100.3737 27.0025 41.3789 2.9624
temp: 298.150 k
press: 1.00000 atm
elementType: 9 8 8 8 6 6 6 6 6 6 6 6 6 6 6 6 6 6 1 1 1 1 1 1 1 1 1 1 1 1 1 1 1 1 1 1 1 1 1 1 1 1 1
symmnumber: 1
zpe: 966257.0 jmol-1
zpe.correction: 0.368028 hartree
zpe.thermalcorrener: 0.390743 hartree
zpe.thermalcorrenthalpy: 0.391687 hartree
zpe.thermalcorrgfe: 0.309536 hartree
zpe.sumelectzpe: -872.543779 hartree
zpe.sumelectthermal: -872.521064 hartree
zpe.sumelectthermalent: -872.520120 hartree
zpe.sumelectthermalfe: -872.602271 hartree
dipole: -4.0313 -1.4331 -2.6308
dipole: 5.0226
quadrupole: -129.5936 -111.8615 -110.5941
quadrupole: 9.0259 -6.8575 -8.8438
quadrupole: -12.2439 5.4882 6.7556 9.0259 -6.8575 -8.8438
hfenergy: -872.9118069 hartree
pointgroup: C01 [X(C14H25F1O3)]
dipole: -1.5654989 0.6671579 -1.0044415 debye
polarizability: 217.7020688|2.0517305|131.1748144|1.9340926|1.4379806|145.7067608 unknown
InChI: InChI=1S/C14H25FO3/c1-2-18-14(17)12-13(16)10-8-6-4-3-5-7-9-11-15/h2-12H2,1H3
charge 0 multiplicity 1
43 atoms
F  9.583186 -1.102763 -0.328165
O  -2.82592 0.668095 2.501664
O  -5.987485 0.352702 -0.065686
O  -4.079829 0.488905 -1.396642
C  2.172545 0.24628 0.70247
C  3.39333 0.404093 -0.231588
C  0.880848 0.869933 0.127685
C  4.688469 -0.204134 0.351349
C  -0.340191 0.688525 1.055992
C  5.905216 -0.059276 -0.590515
C  -1.614706 1.326744 0.475364
C  7.199052 -0.663232 0.00714
C  -2.848709 1.177527 1.353065
C  8.384369 -0.516888 -0.942962
C  -4.184401 1.699122 0.764874
C  -4.703929 0.801382 -0.353517
C  -6.615977 -0.549163 -1.087406
C  -8.01159 -0.884804 -0.574589
H  2.398225 0.712096 1.684321
H  2.000389 -0.831754 0.902724
H  3.170685 -0.073763 -1.208567
H  3.557279 1.481763 -0.442604
H  0.66404 0.415967 -0.861845
H  1.050264 1.951945 -0.057062
H  4.917468 0.281218 1.322668
H  4.522454 -1.27894 0.572211
H  -0.520977 -0.389567 1.232448
H  -0.128603 1.126234 2.050555
H  6.065457 1.015754 -0.816729
H  5.676606 -0.551304 -1.55901
H  -1.864736 0.913213 -0.524237
H  -1.460232 2.414197 0.299422
H  7.045263 -1.736527 0.230195
H  7.440316 -0.16374 0.965069
H  8.222353 -1.058313 -1.89426
H  8.622862 0.544121 -1.147753
H  -4.012685 2.701781 0.328872
H  -4.933359 1.765028 1.567381
H  -6.631482 -0.015591 -2.054806
H  -5.97464 -1.442265 -1.195317
H  -7.960754 -1.395526 0.401861
H  -8.621021 0.027666 -0.459576
H  -8.520449 -1.554638 -1.291494
