program: Gaussian 09
title: 000092020
version: EM64L-G09RevD.01
frameworkgroup: C1[X(C14H12O2)]
method: RPBEPBE
basis: SDD
operation: Freq
keyword: #pfreq=noraman
keyword: PBEPBE/SDD
title: #p freq=noraman PBEPBE/SDD
converged: YES YES NO NO
title: Mulliken charges:
elementType: O O C C C C C C C C C C C C C C H H H H H H H H H H H H
charge: -0.419692 -0.427753 0.162579 0.253930 -0.529869 -0.594049 -0.209513 -0.182760 0.404849 0.262352 -0.198302 -0.236643 -0.395795 -0.409726 -0.267209 -0.238907 0.242454 0.242549 0.227468 0.225693 0.214280 0.213104 0.190873 0.282848 0.227279 0.230509 0.355907 0.373544
chargesum: 0.00000
title: Mulliken charges with hydrogens summed into heavy atoms:
elementType: O O C C C C C C C C C C C C C C
charge: -0.063786 -0.054208 0.162579 0.253930 -0.044866 -0.140888 -0.209513 -0.182760 0.404849 0.262352 0.015978 -0.023539 -0.204922 -0.126879 -0.039930 -0.008398
polarizability: 2.33003414e+02 -1.95434720e+00 1.75472261e+02 -3.58180050e-02 1.21189982e-02 6.80454761e+01
1716.lowfreq: -12.8615 -11.7414 -0.0005 -0.0003 0.0005 7.9331 60.1180 76.3320 107.4313
frequency: 60.0999 76.3246 107.4225 130.5225 171.1252 204.1666 220.4933 225.1919 281.2464 297.1363 327.6668 368.9057 378.8345 386.9136 425.8209 439.6857 467.7906 520.6666 562.8395 566.3274 619.7139 620.9970 651.8312 662.5209 684.2467 758.0364 758.4360 795.4944 829.4779 872.3543 883.0892 943.4160 946.2554 950.6353 958.8380 972.3185 986.9568 992.6914 1027.9475 1039.0475 1070.2995 1110.8657 1166.2566 1173.6346 1176.9740 1192.3420 1192.4618 1204.8893 1210.6788 1274.3251 1326.0828 1329.8708 1346.3891 1369.0643 1384.9891 1413.6761 1422.5016 1435.3140 1450.4432 1452.6157 1467.0215 1522.5854 1583.8220 1603.7425 1643.6383 1700.8294 2901.8412 2928.5721 2959.6374 2986.4034 3087.4312 3102.7500 3134.7315 3135.1469 3155.4446 3176.0527 3591.6871 3594.3181
redmass: 3.7838 2.2102 2.7342 1.9581 4.7312 1.4714 4.7349 1.5555 5.3361 2.8772 5.4653 6.4625 2.4859 4.1885 5.9818 2.8067 9.4193 3.8310 6.1281 5.7940 3.1370 5.3192 5.6870 2.7744 1.4485 1.4561 6.8127 2.4018 4.6082 1.9697 4.8725 1.7900 2.5346 1.3765 1.6342 3.2965 1.5031 1.3391 2.5373 3.3066 4.8753 2.0895 1.4887 1.1174 1.1022 1.1042 1.4101 1.4436 1.0871 1.6333 3.1263 2.0747 1.9110 2.5951 1.8157 6.3278 2.4231 2.6911 1.6453 1.2911 2.0508 4.2398 8.1232 6.3853 7.4589 6.5833 1.0579 1.0982 1.0612 1.0962 1.0878 1.0838 1.0993 1.0883 1.0947 1.0974 1.0654 1.0655
irintensity: 0.6745 14.6807 0.2263 2.0836 5.8955 56.5395 1.0293 132.5490 0.2459 27.7531 21.1368 1.2203 0.0584 0.0325 0.2847 8.2972 0.2429 0.0429 5.1391 0.2677 32.0158 1.5155 2.3656 12.6879 27.6448 102.0402 25.4221 3.8241 37.4011 0.8886 0.9853 3.4744 22.8116 1.6575 0.9952 67.0885 0.0089 0.8181 30.4943 41.3153 1.1713 0.2432 193.6979 1.3461 13.0359 5.3884 102.9172 6.5690 0.2990 39.5414 44.8123 15.6860 0.0750 72.5881 26.4453 2.5984 27.4281 10.9648 24.3028 6.9946 0.6714 11.3665 9.2049 17.5242 0.5505 14.9515 42.0024 23.6917 16.9704 12.9698 19.4643 6.8511 74.8601 14.7580 23.2922 13.7710 40.8159 9.8469
temp: 298.150 k
press: 1.00000 atm
elementType: 8 8 6 6 6 6 6 6 6 6 6 6 6 6 6 6 1 1 1 1 1 1 1 1 1 1 1 1
symmnumber: 1
zpe: 575121.5 jmol-1
zpe.correction: 0.219052 hartree
zpe.thermalcorrener: 0.232495 hartree
zpe.thermalcorrenthalpy: 0.233439 hartree
zpe.thermalcorrgfe: 0.179555 hartree
zpe.sumelectzpe: -690.010849 hartree
zpe.sumelectthermal: -689.997406 hartree
zpe.sumelectthermalent: -689.996462 hartree
zpe.sumelectthermalfe: -690.050346 hartree
dipole: 0.5209 -0.0223 -0.0196
dipole: 0.5217
quadrupole: -80.1637 -82.7229 -98.6266
quadrupole: -9.6741 -0.0134 0.0647
quadrupole: 7.0074 4.4481 -11.4556 -9.6741 -0.0134 0.0647
hfenergy: -690.2299009 hartree
pointgroup: C01 [X(C14H12O2)]
dipole: -0.2049288 -0.0090888 0.0072261 debye
polarizability: 232.9999352|1.9964028|175.4405671|0.2579079|1.9355431|68.0806492 unknown
InChI: InChI=1S/C14H12O2/c15-13-9-5-1-2-6-10(9)14(16)12-8-4-3-7-11(12)13/h1-6,15-16H,7-8H2
charge 0 multiplicity 1
28 atoms
O  -0.102534 2.819895 0.068749
O  0.081601 -2.815059 -0.033225
C  -1.224718 0.715732 0.029629
C  -1.222669 -0.717554 0.00312
C  -2.514309 1.518363 0.042867
C  -2.521133 -1.51694 -0.015705
C  -0.005326 1.408555 0.04367
C  0.003237 -1.404131 -0.006683
C  1.260596 0.727658 0.032892
C  1.259955 -0.718504 0.007356
C  -3.769815 0.681769 0.024681
C  -3.777603 -0.67278 -0.001526
C  2.523488 1.408993 0.046324
C  2.506159 -1.423562 -0.003275
C  3.726521 0.699446 0.03544
C  3.718206 -0.730601 0.010487
H  -2.518371 2.187277 0.928859
H  -2.515496 2.220933 -0.816646
H  -2.55043 -2.172595 -0.91692
H  -2.555425 -2.208085 0.858629
H  -4.723247 1.226663 0.033553
H  -4.730903 -1.216955 -0.013843
H  2.571533 2.506783 0.065349
H  2.480349 -2.516392 -0.022371
H  4.680085 1.238345 0.046056
H  4.666473 -1.278437 0.002186
H  0.792835 3.237181 0.078612
H  -0.820559 -3.218498 -0.030164
