program: Gaussian 09
title: 000091997
version: EM64L-G09RevD.01
frameworkgroup: C1[X(C9H12O2S)]
method: RPBEPBE
basis: SDD
operation: Freq
keyword: #p
keyword: freq=noraman
keyword: PBEPBE/SDD
title: #p freq=noraman PBEPBE/SDD
converged: YES YES NO NO
title: Mulliken charges:
elementType: S O O C C C C C C C C C H H H H H H H H H H H H
charge: 0.323161 -0.276951 -0.252506 -0.370104 -0.344410 -0.251445 -0.687347 0.331615 -0.302593 -0.235414 -0.127899 -0.511642 0.207900 0.207635 0.197484 0.197847 0.225475 0.225165 0.211850 0.211813 0.219247 0.281314 0.250451 0.269354
chargesum: 0.00000
title: Mulliken charges with hydrogens summed into heavy atoms:
elementType: S O O C C C C C C C C C
charge: 0.323161 -0.276951 -0.252506 0.045430 0.050921 0.199195 -0.044436 0.331615 -0.302593 0.045900 0.122552 -0.242288
polarizability: 1.74023405e+02 7.91217819e+00 1.23341103e+02 1.07978283e-01 -9.56148073e-02 6.53344835e+01
1716.lowfreq: -32.5585 -5.0521 0.0006 0.0025 0.0027 5.7809 16.6289 44.8531 57.1883
frequency: -20.3889 44.0828 57.1747 73.9300 99.1623 130.0279 151.4885 205.8655 227.9455 237.8398 250.0300 385.8581 423.3197 439.5228 471.0718 562.7529 632.9967 697.4972 704.6792 719.4898 737.5722 752.8886 794.7756 823.6582 855.2155 878.0377 910.7864 928.5529 930.7519 1005.4470 1041.5658 1060.3025 1082.3411 1091.9557 1124.0321 1147.2475 1211.4598 1214.4064 1243.9787 1269.6158 1273.0047 1285.9308 1337.8936 1345.4287 1373.6615 1391.8854 1455.8209 1467.1307 1470.7392 1479.0344 1480.2262 1489.0974 1526.2071 1618.2691 2969.2919 2975.9571 2989.7914 3000.2808 3012.6944 3043.1297 3069.1449 3076.3576 3077.4724 3179.7271 3202.1386 3235.3446
redmass: 2.3574 2.6019 4.5342 5.6353 2.3002 3.3144 4.4204 4.3360 5.5475 1.1480 5.8171 4.9350 3.4307 5.7245 8.4746 3.0916 10.1864 6.6403 6.4295 1.2167 1.0713 8.1970 1.1401 4.9478 1.2989 5.3552 1.9949 1.3426 1.2005 4.2722 3.3050 1.9794 2.1020 1.1659 2.6210 1.4860 1.3436 1.6855 3.0528 1.1589 1.3733 1.0822 2.0797 1.5770 1.5936 1.2193 6.3379 1.0811 1.0739 1.0421 1.0677 1.0897 5.9973 11.4990 1.0584 1.0367 1.0597 1.0566 1.1004 1.1037 1.1041 1.0994 1.1048 1.0901 1.0977 1.1004
irintensity: 0.6308 0.6288 0.8103 0.4290 0.2900 3.0460 0.6127 1.5677 2.7781 0.2114 8.4146 5.2474 7.3195 1.3623 0.1580 0.0411 3.4047 5.3351 5.9085 124.0055 8.8918 1.3630 0.5995 18.5385 8.7772 9.0597 6.2381 0.4775 1.3011 194.3054 47.0358 171.4450 5.6098 29.4520 1.6834 2.0786 0.0077 2.9755 314.1393 0.5127 31.5876 0.1002 3.9856 4.7515 5.2639 7.5310 68.3695 0.0830 0.6159 13.1801 4.8898 18.8431 34.8655 235.3047 27.4276 31.4021 16.2151 41.7509 6.1721 2.3208 1.3744 50.3023 126.1317 5.3330 0.6472 0.5219
temp: 298.150 k
press: 1.00000 atm
elementType: 16 8 8 6 6 6 6 6 6 6 6 6 1 1 1 1 1 1 1 1 1 1 1 1
symmnumber: 1
zpe: 499111.9 jmol-1
zpe.correction: 0.190102 hartree
zpe.thermalcorrener: 0.202252 hartree
zpe.thermalcorrenthalpy: 0.203196 hartree
zpe.thermalcorrgfe: 0.150253 hartree
zpe.sumelectzpe: -897.741368 hartree
zpe.sumelectthermal: -897.729218 hartree
zpe.sumelectthermalent: -897.728274 hartree
zpe.sumelectthermalfe: -897.781217 hartree
dipole: -0.6120 2.8878 -0.0068
dipole: 2.9519
quadrupole: -61.5262 -81.9908 -80.5582
quadrupole: 6.5353 0.0240 -0.0169
quadrupole: 13.1655 -7.2991 -5.8665 6.5353 0.0240 -0.0169
hfenergy: -897.9314695 hartree
pointgroup: C01 [X(C9H12O2S1)]
dipole: 0.1941729 -1.1450314 -0.0038875 debye
dipolederiv: 0.103422 0.0593447 0.000307 0.087271 -0.2098887 -0.0017217 0.0005821 -0.0016124 0.1759995 -1.9826485 0.1618123 0.0004891 0.4840062 -0.4941603 -0.0006055 0.0005285 -0.0005352 -0.2760863 -0.7635329 -0.1501833 -0.0002471 -0.0100756 -0.9694855 -0.0013087 -0.0002449 -0.0016159 -0.3217627 -0.1408349 0.032007 -0.0002293 -0.029059 0.0354945 0.0012632 -0.0000023 0.0006492 0.1555731 0.0862003 0.0267453 -0.0004041 0.1466843 0.075163 0.0011564 -0.0015892 0.0015614 0.1806026 1.066222 0.0075418 -0.0007393 0.1167221 0.237685 -0.0004928 0.0011932 -0.0008334 0.3600239 -0.056295 0.0561819 -0.0007857 0.0010855 0.0383385 0.0010122 -0.0000106 0.0009086 0.0942325 2.2687776 0.2299735 0.0001265 -0.1544865 1.2632128 0.0018853 -0.0010137 0.0023439 0.2797047 -0.4774325 -0.4774218 -0.0018842 -0.7532681 -0.1281589 0.0013328 -0.0024007 0.0010699 -0.1954986 0.1995269 0.0117603 -0.0002719 0.3336728 -0.0842487 -0.000321 0.0007008 -0.0001535 -0.094267 -0.3515377 0.111923 0.0006824 0.1820971 -0.0309384 0.0002982 0.0011012 0.0003954 -0.1483669 -0.1249554 0.0358355 -0.0001402 -0.2046955 0.2751623 0.0026365 -0.0010795 0.0023439 -0.2991886 0.0613773 -0.0220454 -0.0182277 -0.0027309 -0.0185284 -0.1043972 -0.0293067 -0.115006 -0.0696777 0.061585 -0.0212979 0.0182113 -0.0020224 -0.0160196 0.1037207 0.0291205 0.114514 -0.0729179 0.0354626 0.0072833 -0.0014512 -0.0236081 -0.0459909 -0.1242019 -0.0282806 -0.1450749 -0.08271 0.0344707 0.0065479 0.0018318 -0.0235246 -0.0391452 0.1230492 0.0294877 0.1440112 -0.0892765 -0.0667294 -0.0001727 0.0009188 -0.0611004 0.0006243 -0.0806113 -0.021823 -0.0927684 -0.061271 -0.0679185 -0.0007203 -0.000326 -0.0612208 0.0014258 0.0806276 0.0221236 0.0931141 -0.0632988 0.0880575 -0.0194637 0.0482526 0.0298698 -0.0156876 0.1123158 0.0039414 0.1358946 -0.0897038 0.0882171 -0.0204421 -0.0473205 0.0301373 -0.0227587 -0.1142877 -0.0043621 -0.1378193 -0.0827705 -0.2184068 -0.0519687 0.0005169 -0.0811021 0.0449584 0.0007215 0.0007484 0.0007183 0.1023011 0.0738406 0.0591005 0.0004548 0.1015343 0.0688092 -0.0005906 0.0006548 -0.0005442 0.1883401 0.0835064 -0.0389043 -0.0000281 -0.0814171 -0.0551085 -0.0009742 -0.0001773 -0.0010163 0.1956399 -0.0003744 -0.0034365 0.0002643 -0.0247693 0.0892456 -0.0005068 0.0001086 -0.0005451 0.2143788 unknown
polarizability: 174.584904|5.8166524|122.7793651|-0.0110855|0.173588|65.3347219 unknown
InChI: InChI=1S/C9H12O2S/c1-2-3-6-11-9(10)8-5-4-7-12-8/h4-5,7H,2-3,6H2,1H3
charge 0 multiplicity 1
24 atoms
S  -3.333461 1.033242 0.004215
O  0.586554 -0.006168 -0.003018
O  -0.401073 2.117746 0.002796
C  2.974437 -0.459056 0.002486
C  4.412755 0.112192 -0.002135
C  1.926577 0.653334 -0.003487
C  5.486052 -0.996833 0.014412
C  -0.511534 0.86436 -0.000335
C  -1.775551 0.118853 -0.001536
C  -1.992796 -1.257422 -0.006997
C  -3.383673 -1.615907 -0.006781
C  -4.229509 -0.512292 -0.001109
H  2.825427 -1.106431 -0.883112
H  2.826761 -1.095168 0.896435
H  4.55062 0.773106 0.877547
H  4.553931 0.750365 -0.897855
H  1.997916 1.302396 0.889314
H  2.00048 1.295438 -0.901137
H  5.389095 -1.62976 0.916364
H  5.391109 -1.655112 -0.869484
H  6.505119 -0.569351 0.009416
H  -1.166506 -1.970778 -0.011065
H  -3.745999 -2.646361 -0.010726
H  -5.318231 -0.490091 0.000391
