program: Gaussian 09
title: 000009485
version: EM64L-G09RevD.01
frameworkgroup: C1[X(C9H21N3)]
method: RPBEPBE
basis: SDD
operation: Freq
keyword: #pfreq=noraman
keyword: PBEPBE/SDD
title: #p freq=noraman PBEPBE/SDD
converged: NO YES NO NO
title: Mulliken charges:
elementType: N N N C C C C C C C C C H H H H H H H H H H H H H H H H H H H H H
charge: -0.108561 -0.669002 -0.418743 -0.369814 -0.431690 -0.032064 -0.041345 -0.716112 -0.710656 -0.701479 -0.694242 0.194698 0.243801 0.187562 0.192176 0.223048 0.253299 0.218372 0.189992 0.214297 0.228228 0.195687 0.211604 0.224539 0.194312 0.213250 0.248249 0.207765 0.220596 0.203966 0.311247 0.312306 0.204714
chargesum: 0.00000
title: Mulliken charges with hydrogens summed into heavy atoms:
elementType: N N N C C C C C C C C C
charge: -0.108561 -0.045449 -0.214029 0.061549 -0.016466 0.221235 0.177027 -0.083595 -0.078825 -0.045668 -0.061914 0.194698
polarizability: 1.34299710e+02 2.25857167e+00 1.23551633e+02 -1.00334042e+01 -2.21874287e+00 1.02759033e+02
1716.lowfreq: -6.9665 -0.0006 0.0001 0.0003 10.1964 13.1249 40.6649 50.8441 60.2919
frequency: 40.3298 50.6738 60.1424 75.7618 84.8848 112.8454 191.2853 210.6707 219.3474 246.3515 258.6500 261.6651 281.4637 292.9378 306.9085 318.5022 352.7575 363.2581 399.0881 415.1536 444.5021 460.3278 520.7228 623.4678 675.9521 692.6452 769.6453 806.4443 811.5772 871.7057 902.7255 916.7025 918.7676 933.4407 940.5268 958.0419 961.3799 1015.7872 1048.2215 1079.1589 1108.5212 1134.0823 1138.1727 1177.3896 1180.1289 1191.4266 1219.5143 1278.2628 1290.8910 1301.5524 1318.2122 1341.7409 1345.1697 1348.4590 1365.3448 1369.7375 1376.9905 1388.3358 1394.5735 1423.1848 1443.8296 1466.6814 1468.3547 1471.4412 1473.3497 1481.1471 1483.3572 1487.4687 1489.0511 1494.4622 1602.4934 1633.2350 2931.8695 2958.5373 2963.8917 2964.9701 2970.1370 2979.9710 2984.8178 3011.0612 3033.9146 3049.5729 3053.8851 3054.5822 3063.2841 3065.5870 3066.8946 3072.2071 3072.9116 3083.1674 3387.3085 3558.7938 3704.6821
redmass: 3.4852 2.5739 2.8166 3.1401 3.3772 4.2231 2.7756 1.0780 1.0661 1.2056 1.0781 1.6601 2.7210 1.9016 1.8866 1.0956 2.4779 2.3893 2.4087 1.8401 2.9044 1.8251 2.5447 4.1969 1.7783 2.3921 2.9501 2.7166 2.7377 1.4135 1.4727 1.2477 1.2183 1.9127 1.7471 1.4695 1.4927 2.2556 1.3767 1.6965 1.7617 2.3184 2.3700 1.8379 1.8250 2.3255 2.4877 1.5348 1.3012 1.5754 1.2857 1.3681 1.3312 1.4033 1.2753 1.2871 1.2136 1.2263 1.2243 2.1668 1.2501 1.0527 1.0573 1.0526 1.0490 1.0545 1.0508 1.0952 1.0503 1.1396 2.2770 1.5558 1.0689 1.0366 1.0368 1.0361 1.0392 1.0804 1.0614 1.0826 1.0928 1.0979 1.1009 1.0990 1.0983 1.0986 1.0995 1.0992 1.0985 1.0991 1.0766 1.0452 1.1033
irintensity: 7.6514 0.5328 0.1901 1.2904 5.9255 0.9745 0.1317 0.1343 0.0406 2.5575 1.4979 54.8401 0.2593 134.2888 18.7326 65.9939 5.8519 3.1633 1.6740 7.1646 8.7025 10.7387 12.0499 12.6670 25.4126 64.1874 2.6088 7.7035 11.7577 7.4844 8.1770 7.3481 4.0220 5.5593 12.5388 3.5838 0.2274 12.2669 44.1953 109.2688 83.6441 0.3015 0.5301 11.4754 6.4116 5.5991 23.6777 4.5039 1.8186 18.6665 15.1415 12.3886 1.1122 18.9311 3.3056 24.6015 23.0850 24.0189 25.4350 80.4086 44.5749 0.3630 5.2454 9.7737 7.0735 8.0317 8.5269 2.4055 40.7025 36.5452 306.7675 171.9826 58.3320 35.5858 38.0832 40.4362 15.7282 13.4929 34.7081 1.6960 15.2964 13.3804 16.8272 26.6966 40.1008 99.3772 38.8917 55.9961 57.1677 34.9294 18.4528 10.0799 24.9096
temp: 298.150 k
press: 1.00000 atm
elementType: 7 7 7 6 6 6 6 6 6 6 6 6 1 1 1 1 1 1 1 1 1 1 1 1 1 1 1 1 1 1 1 1 1
symmnumber: 1
zpe: 775258.1 jmol-1
zpe.correction: 0.295280 hartree
zpe.thermalcorrener: 0.311113 hartree
zpe.thermalcorrenthalpy: 0.312057 hartree
zpe.thermalcorrgfe: 0.252573 hartree
zpe.sumelectzpe: -518.798203 hartree
zpe.sumelectthermal: -518.782371 hartree
zpe.sumelectthermalent: -518.781427 hartree
zpe.sumelectthermalfe: -518.840910 hartree
dipole: -3.0571 -0.0924 1.9085
dipole: 3.6051
quadrupole: -77.3916 -70.0539 -79.2503
quadrupole: -5.2708 -0.7831 4.5895
quadrupole: -1.8263 5.5114 -3.6850 -5.2708 -0.7831 4.5895
hfenergy: -519.0934834 hartree
pointgroup: C01 [X(C9H21N3)]
dipole: 1.1597273 0.0553517 0.8146943 debye
polarizability: 133.1323757|2.4642865|123.6499812|11.6510453|1.5458575|103.8280191 unknown
InChI: InChI=1S/C9H21N3/c1-7(2)5-12(9(10)11)6-8(3)4/h7-8,10H,5-6,11H2,1-4H3
charge 0 multiplicity 1
33 atoms
N  -0.014636 -0.36826 0.077595
N  0.947376 -2.42571 0.796881
N  -0.993618 -2.378642 -0.65418
C  -1.074399 0.354054 -0.664836
C  1.059763 0.390698 0.739247
C  -2.43097 0.444682 0.084718
C  2.415734 0.448174 -0.029825
C  -2.310339 1.223229 1.413238
C  -3.486572 1.084587 -0.846305
C  2.253326 1.132978 -1.404726
C  3.470704 1.173675 0.838069
C  -0.050568 -1.767957 0.049387
H  -1.241358 -0.172535 -1.622054
H  -0.701511 1.374199 -0.882337
H  1.237944 0.005898 1.768122
H  0.69574 1.426176 0.875602
H  -2.737459 -0.596883 0.299411
H  2.757406 -0.592076 -0.20809
H  -2.021036 2.278276 1.231429
H  -3.274184 1.230232 1.955888
H  -1.554341 0.765279 2.077381
H  -3.198639 2.117875 -1.125901
H  -4.473535 1.134919 -0.350304
H  -3.603656 0.498272 -1.776555
H  1.937852 2.188395 -1.285216
H  3.208469 1.128161 -1.961559
H  1.4978 0.613428 -2.019929
H  3.161288 2.217096 1.04358
H  4.448014 1.21058 0.323418
H  3.620311 0.668635 1.812125
H  1.623031 -1.937233 1.376956
H  0.918166 -3.43925 0.848761
H  -0.921905 -3.411152 -0.614293
