program: Gaussian 09
title: 000090960
version: EM64L-G09RevD.01
frameworkgroup: C1[X(C9H18O2)]
method: RPBEPBE
basis: SDD
operation: Freq
keyword: #pfreq=noraman
keyword: PBEPBE/SDD
title: #p freq=noraman PBEPBE/SDD
converged: YES YES NO NO
title: Mulliken charges:
elementType: O O C C C C C C C C C H H H H H H H H H H H H H H H H H H
charge: -0.415063 -0.237455 0.324765 -0.444225 -0.018837 -0.720485 -0.744739 -0.731905 -0.520979 -0.727483 0.168628 0.188229 0.217217 0.241185 0.205761 0.207182 0.219874 0.205788 0.228478 0.209662 0.216993 0.208568 0.210561 0.250473 0.248500 0.218904 0.208102 0.207470 0.374832
chargesum: 0.00000
title: Mulliken charges with hydrogens summed into heavy atoms:
elementType: O O C C C C C C C C C
charge: -0.040230 -0.237455 0.324765 -0.038780 0.222348 -0.087668 -0.100811 -0.095782 -0.022007 -0.093007 0.168628
polarizability: 1.15088389e+02 8.13567026e-01 1.02705030e+02 3.74881034e+00 -2.43920028e+00 9.08479563e+01
1716.lowfreq: -23.8697 -16.0856 -10.1000 -4.8152 -0.0004 -0.0001 0.0003 27.1824 63.7938
frequency: -12.8920 26.9844 63.7383 90.9903 151.7294 166.9921 179.6448 222.3308 245.0354 266.3968 271.3842 291.9724 331.4980 342.8699 385.0785 404.0296 424.2984 429.4713 499.6920 531.4740 596.6688 648.5045 732.3854 819.9635 846.3506 854.1601 896.5660 917.7888 925.1566 934.3206 941.5416 963.7156 1003.6176 1018.5032 1038.6973 1086.6088 1099.4079 1148.7526 1167.8688 1208.3895 1222.4857 1244.7949 1252.0666 1289.2167 1294.0293 1344.1541 1346.0055 1365.9048 1371.5048 1374.9859 1388.6250 1400.9005 1431.4472 1450.1271 1458.5094 1462.1349 1465.6712 1470.9967 1478.5969 1485.1957 1491.9954 1495.9045 1663.9540 2946.3979 2962.6538 2967.6648 2970.4703 2974.8287 2981.5605 2999.8523 3016.1746 3044.8143 3055.6010 3057.2071 3060.3344 3062.9201 3065.1792 3070.1991 3083.2280 3092.5976 3506.2942
redmass: 2.9645 8.6574 3.6367 2.2675 2.1502 1.3402 1.8523 1.5037 1.1117 1.2552 1.9709 2.0757 2.2739 2.4528 2.5932 2.0231 2.1048 2.6137 2.1953 2.4168 3.9728 1.4098 3.4169 2.4783 2.8119 1.6433 2.0078 1.7703 1.6449 1.3168 1.7049 1.7535 1.4033 1.4491 2.0304 1.7195 2.3478 2.1250 1.4220 2.1597 1.8038 1.5830 2.5379 1.6095 1.5105 1.4260 1.4573 1.5341 1.2112 1.2238 1.2200 1.2071 1.0882 1.0841 1.0532 1.0551 1.0476 1.0513 1.0550 1.0602 1.0562 1.0540 8.1683 1.0609 1.0348 1.0353 1.0380 1.0378 1.0623 1.0855 1.0965 1.0965 1.0996 1.0995 1.0986 1.1000 1.0984 1.0991 1.0981 1.0953 1.0638
irintensity: 0.1140 1.1552 0.4571 0.2698 1.5558 0.3966 0.0908 0.5914 0.0798 0.3006 0.8419 0.3066 0.0625 2.1661 2.5544 0.3358 4.2860 5.0650 14.6951 30.8647 16.8397 127.9722 3.2606 4.8760 0.7028 4.5493 16.7434 6.6151 1.5475 0.6119 2.5978 31.9232 1.3191 0.8277 232.0001 32.6611 6.0412 16.6918 9.1835 6.8174 6.6293 5.3755 14.2625 9.0493 21.6117 2.8050 26.2525 28.1600 19.8564 23.4861 15.6341 9.1843 27.2432 1.7000 1.4296 5.8457 0.3685 9.2047 4.0033 12.2391 21.6699 20.4319 187.8833 31.0299 42.1488 26.3381 31.0222 33.6433 17.7648 5.5591 22.2517 3.8136 9.3663 8.3301 67.7414 24.3762 83.4377 76.0736 53.4040 35.5694 19.1557
temp: 298.150 k
press: 1.00000 atm
elementType: 8 8 6 6 6 6 6 6 6 6 6 1 1 1 1 1 1 1 1 1 1 1 1 1 1 1 1 1 1
symmnumber: 1
zpe: 665971.6 jmol-1
zpe.correction: 0.253655 hartree
zpe.thermalcorrener: 0.266809 hartree
zpe.thermalcorrenthalpy: 0.267753 hartree
zpe.thermalcorrgfe: 0.214267 hartree
zpe.sumelectzpe: -503.301648 hartree
zpe.sumelectthermal: -503.288495 hartree
zpe.sumelectthermalent: -503.287550 hartree
zpe.sumelectthermalfe: -503.341037 hartree
dipole: -0.2483 0.9150 -0.8655
dipole: 1.2837
quadrupole: -65.8702 -69.2622 -72.7690
quadrupole: 1.1473 0.8794 2.8704
quadrupole: 3.4303 0.0383 -3.4685 1.1473 0.8794 2.8704
hfenergy: -503.5553033 hartree
pointgroup: C01 [X(C9H18O2)]
dipole: -0.1015491 0.3059007 -0.388839 debye
polarizability: 115.2675101|1.0797634|101.6688763|3.0156186|-4.1748066|91.7049895 unknown
InChI: InChI=1S/C9H18O2/c1-7(5-8(10)11)6-9(2,3)4/h7,10H,5-6H2,1-4H3
charge 0 multiplicity 1
29 atoms
O  -3.654655 -0.561079 -0.501758
O  -2.177017 -0.996944 1.231126
C  2.021186 -0.424867 -0.032592
C  0.555516 -0.143658 -0.517921
C  -0.2692 0.994589 0.150642
C  3.0536 0.534137 -0.68836
C  2.127086 -0.336061 1.512654
C  2.375926 -1.874382 -0.474073
C  -1.744951 0.899002 -0.31642
C  0.259005 2.420598 -0.133786
C  -2.486796 -0.302681 0.237527
H  0.578931 0.032282 -1.615577
H  -0.013342 -1.082642 -0.362132
H  -0.264882 0.826507 1.245064
H  3.007231 0.467817 -1.792247
H  4.080298 0.261332 -0.377099
H  2.889484 1.587597 -0.405587
H  3.126805 -0.669703 1.849789
H  1.369183 -0.97684 2.001121
H  1.982908 0.699019 1.874492
H  1.725261 -2.613005 0.030864
H  3.426596 -2.1174 -0.226204
H  2.247725 -1.998659 -1.56665
H  -2.3094 1.795371 0.014071
H  -1.821298 0.882363 -1.419911
H  1.244174 2.590029 0.331531
H  0.364679 2.600103 -1.221119
H  -0.430891 3.185798 0.271114
H  -4.135062 -1.329927 -0.088659
