program: Gaussian 09
title: 000090928
version: EM64L-G09RevD.01
frameworkgroup: C1[X(C9H20O2)]
method: RPBEPBE
basis: SDD
operation: Freq
keyword: #pfreq=noraman
keyword: PBEPBE/SDD
title: #p freq=noraman PBEPBE/SDD
converged: YES YES NO NO
title: Mulliken charges:
elementType: O O C C C C C C C C C H H H H H H H H H H H H H H H H H H H H
charge: -0.438287 -0.437300 -0.442273 -0.361499 -0.056984 -0.370545 -0.353918 -0.442623 -0.356184 -0.324615 -0.695732 0.199742 0.198843 0.221203 0.190511 0.208361 0.185629 0.189595 0.188382 0.191236 0.192862 0.214602 0.194042 0.194559 0.240965 0.182969 0.321812 0.215184 0.210558 0.209850 0.329053
chargesum: 0.00000
title: Mulliken charges with hydrogens summed into heavy atoms:
elementType: O O C C C C C C C C C
charge: -0.116475 -0.108248 -0.043687 0.050215 0.151377 0.004679 0.025700 -0.035160 0.032418 0.099320 -0.060140
polarizability: 1.33424851e+02 -2.42721068e+00 9.45627626e+01 -3.86223434e-01 -2.49749280e-01 8.99875639e+01
1716.lowfreq: -22.3561 -9.8184 -0.0005 0.0001 0.0008 10.1990 24.6278 33.8918 50.7252
frequency: 24.2754 31.1517 50.7016 73.3489 91.8349 108.2529 115.6092 137.1629 148.0649 209.9944 221.9464 225.3925 299.4984 317.7149 325.2651 367.8488 415.6672 427.6393 495.9657 566.6986 721.1231 734.9247 776.3394 781.8590 839.7350 886.1845 887.9536 944.0917 967.5146 996.2475 1007.7532 1015.1529 1046.7767 1058.2982 1066.0066 1077.6603 1084.1791 1096.2454 1124.8863 1134.9414 1189.2105 1217.3297 1231.9474 1244.9543 1261.4379 1274.0936 1283.2453 1286.2437 1291.1872 1316.0102 1320.7083 1336.5342 1348.7004 1355.1519 1359.3083 1364.3281 1377.4900 1387.6921 1446.2386 1457.4603 1462.4670 1465.1553 1473.7322 1475.4919 1481.8669 1482.3920 1488.5008 2945.0663 2948.9792 2952.7515 2954.9839 2961.2014 2965.5801 2969.8117 2971.7034 2986.2260 2998.1101 3003.1590 3009.0432 3026.2424 3032.4820 3046.8282 3068.3529 3070.2192 3102.1466 3534.7249 3556.5982
redmass: 3.7250 1.8111 3.6827 3.3495 2.0381 1.9469 2.6739 3.0396 2.2512 4.5390 1.3960 2.1928 1.4730 1.3901 1.5470 2.9460 3.5718 2.4271 2.4448 3.3335 1.0653 1.1252 1.3649 1.3374 1.6659 1.5333 1.7852 3.5919 1.3607 3.9828 2.1854 2.0488 3.6232 1.5781 2.1947 2.6837 2.1435 1.2865 2.7994 1.5017 1.6979 1.2903 1.4266 1.3435 1.2808 1.1139 1.0825 1.1717 1.1985 1.2436 1.2959 1.3395 1.4639 1.6297 1.6394 1.1800 1.2879 1.2171 1.0843 1.0804 1.0674 1.0756 1.0722 1.0431 1.0812 1.0812 1.0905 1.0608 1.0595 1.0708 1.0589 1.0604 1.0605 1.0614 1.0363 1.0961 1.0931 1.0995 1.0946 1.1016 1.0971 1.1023 1.1007 1.0993 1.0944 1.0657 1.0662
irintensity: 0.4730 0.9365 1.5723 1.8422 4.7684 0.7725 0.9441 0.4873 0.3368 1.1946 1.8554 4.6286 43.2531 215.3580 48.1843 26.0012 9.3008 2.9965 2.6203 26.3704 11.5387 0.1506 1.2828 4.2733 22.2318 11.5567 5.9952 80.8624 4.4699 3.7727 8.8893 35.1856 20.1147 23.0179 14.9297 8.1737 2.5184 19.9079 4.9925 31.6519 1.2425 23.0254 11.5541 6.2421 2.2900 1.8180 0.3225 0.1558 2.9261 3.0166 6.2693 4.5447 0.7184 1.7280 5.0119 28.6796 20.2367 10.8846 0.5581 5.1581 0.0173 0.8760 1.8609 12.3127 2.1952 5.3680 24.7534 5.0763 14.7560 45.8006 6.1995 30.7980 6.9953 142.5488 42.0889 4.1087 9.0533 3.7681 2.3652 40.5454 16.3613 137.4670 97.4674 54.4502 22.8823 4.0472 6.4647
temp: 298.150 k
press: 1.00000 atm
elementType: 8 8 6 6 6 6 6 6 6 6 6 1 1 1 1 1 1 1 1 1 1 1 1 1 1 1 1 1 1 1 1
symmnumber: 1
zpe: 727837.9 jmol-1
zpe.correction: 0.277219 hartree
zpe.thermalcorrener: 0.292269 hartree
zpe.thermalcorrenthalpy: 0.293214 hartree
zpe.thermalcorrgfe: 0.233241 hartree
zpe.sumelectzpe: -504.443524 hartree
zpe.sumelectthermal: -504.428473 hartree
zpe.sumelectthermalent: -504.427529 hartree
zpe.sumelectthermalfe: -504.487501 hartree
dipole: -1.8526 -2.4199 0.2010
dipole: 3.0543
quadrupole: -88.6549 -71.8884 -66.7444
quadrupole: -7.5228 4.4590 -3.4730
quadrupole: -12.8923 3.8742 9.0182 -7.5228 4.4590 -3.4730
hfenergy: -504.7207426 hartree
pointgroup: C01 [X(C9H20O2)]
dipole: 0.7339633 -0.9327325 -0.1877367 debye
polarizability: 133.4002569|2.6430395|94.4669504|0.0243652|0.7817575|90.1079699 unknown
InChI: InChI=1S/C9H20O2/c1-2-3-4-5-6-9(11)7-8-10/h9-11H,2-8H2,1H3
charge 0 multiplicity 1
31 atoms
O  -1.826178 1.52767 0.597215
O  -5.559829 -0.553598 -0.014028
C  -0.486334 -0.529277 0.145874
C  0.805729 0.231589 -0.222277
C  -1.773113 0.261105 -0.174378
C  2.089794 -0.514989 0.202828
C  3.38519 0.230459 -0.190333
C  -3.058161 -0.566085 0.053287
C  4.672503 -0.510164 0.238751
C  -4.33536 0.191146 -0.354878
C  5.961198 0.240381 -0.161709
H  -0.514339 -1.496471 -0.397016
H  -0.479667 -0.780317 1.229215
H  0.779542 1.233967 0.247829
H  0.82687 0.402141 -1.318965
H  -1.73632 0.61905 -1.221658
H  2.099041 -1.528133 -0.252242
H  2.077383 -0.669383 1.302556
H  3.401613 0.383703 -1.289831
H  3.377751 1.24345 0.263428
H  -2.984488 -1.512683 -0.522946
H  -3.137678 -0.848359 1.123493
H  4.67756 -1.523379 -0.212858
H  4.657039 -0.660139 1.337784
H  -4.414311 1.135067 0.205809
H  -4.308062 0.433754 -1.439701
H  -1.838861 1.296298 1.562385
H  6.866703 -0.3071 0.158913
H  5.992988 1.245775 0.299079
H  6.017299 0.373601 -1.258711
H  -5.561601 -1.411077 -0.510313
