program: Gaussian 09
title: 000090911
version: EM64L-G09RevD.01
frameworkgroup: C1[X(C8H13NO2)]
method: RPBEPBE
basis: SDD
operation: Freq
keyword: #p
keyword: freq=noraman
keyword: PBEPBE/SDD
title: #p freq=noraman PBEPBE/SDD
converged: YES YES NO NO
title: Mulliken charges:
elementType: O O N C C C C C C C C H H H H H H H H H H H H H
charge: -0.415901 -0.236927 -0.570369 -0.046944 -0.460377 -0.441500 -0.244010 -0.452365 -0.209559 -0.192393 0.135724 0.236638 0.210080 0.220798 0.238768 0.203655 0.259021 0.210494 0.215514 0.200690 0.202292 0.281866 0.281958 0.372848
chargesum: 0.00000
title: Mulliken charges with hydrogens summed into heavy atoms:
elementType: O O N C C C C C C C C
charge: -0.043052 -0.236927 -0.006545 0.189694 -0.029499 0.000923 0.015011 -0.026357 -0.008869 0.009898 0.135724
polarizability: 1.05337098e+02 1.29779760e+00 1.03800246e+02 3.36639846e+00 -2.52294482e+00 7.67670690e+01
1716.lowfreq: -12.6620 -0.0008 -0.0007 -0.0004 10.4212 17.3720 30.1901 54.8052 95.6442
frequency: 23.9418 54.7610 95.6063 125.5627 180.0805 233.4015 244.2821 285.3669 333.3620 370.3092 381.1414 415.5274 494.5262 527.1377 602.6163 617.6064 653.5074 658.8267 712.4662 744.1757 814.7521 847.9143 880.0427 916.6406 939.7463 956.9166 971.7761 1004.3182 1036.7371 1052.9063 1072.5170 1097.9714 1118.7538 1133.1179 1141.5114 1195.7337 1223.0781 1231.3550 1256.0598 1285.2915 1304.7959 1325.8930 1335.4023 1336.4558 1358.1164 1364.8231 1381.0619 1453.3763 1459.2200 1468.9426 1639.4243 1649.0601 1674.6534 2946.3929 2955.2921 2967.7244 2977.4904 3007.4219 3034.7042 3038.6186 3048.6703 3090.9212 3123.7130 3443.5142 3487.5679 3573.2943
redmass: 7.7040 3.6249 3.2712 3.9243 1.9334 3.3561 3.8439 1.3450 3.1189 3.1075 2.4662 2.0620 3.9295 3.5244 3.3398 1.2460 1.3157 1.5400 3.2889 2.4074 1.7915 5.0513 2.9139 1.7423 2.7157 2.2394 1.2152 2.1628 2.1354 2.2778 1.6153 2.3584 2.5153 1.1367 1.3735 1.2248 1.4714 1.3266 1.3345 1.4090 1.4127 1.5439 1.5856 1.4174 1.4862 1.4330 1.5697 1.0934 1.0781 1.0980 1.1044 7.4926 6.4284 1.0698 1.0629 1.0745 1.0692 1.0935 1.0975 1.0939 1.0876 1.0838 1.0994 1.0447 1.0638 1.0977
irintensity: 2.3573 0.2563 0.4004 0.2005 0.4930 2.7743 6.5660 42.1514 11.6584 5.8361 3.4447 0.1044 2.2571 23.2449 2.1870 166.0398 79.8354 174.7708 33.2940 9.4585 3.2858 10.7906 20.9359 7.1601 18.4399 3.8277 0.2358 43.3607 189.1799 15.8847 4.6248 5.8479 8.5481 5.8806 5.2640 5.6375 0.1729 0.3063 4.6352 22.0185 1.7094 7.2802 3.7809 3.1010 7.9424 0.7351 0.4796 3.2068 19.5041 5.8069 59.9569 176.4269 6.1121 22.5573 39.9142 10.6941 31.1019 41.5045 28.4102 21.4999 40.4455 9.6670 70.1267 2.4602 13.0936 4.1325
temp: 298.150 k
press: 1.00000 atm
elementType: 8 8 7 6 6 6 6 6 6 6 6 1 1 1 1 1 1 1 1 1 1 1 1 1
symmnumber: 1
zpe: 528617.2 jmol-1
zpe.correction: 0.201340 hartree
zpe.thermalcorrener: 0.212666 hartree
zpe.thermalcorrenthalpy: 0.213610 hartree
zpe.thermalcorrgfe: 0.163263 hartree
zpe.sumelectzpe: -516.973220 hartree
zpe.sumelectthermal: -516.961894 hartree
zpe.sumelectthermalent: -516.960950 hartree
zpe.sumelectthermalfe: -517.011296 hartree
dipole: -0.8872 -0.0097 -0.9830
dipole: 1.3242
quadrupole: -60.6091 -62.5223 -70.8856
quadrupole: -1.7830 3.5368 2.1144
quadrupole: 4.0633 2.1500 -6.2133 -1.7830 3.5368 2.1144
hfenergy: -517.1745593 hartree
pointgroup: C01 [X(C8H13N1O2)]
dipole: -0.3475064 0.0063023 -0.3881069 debye
dipolederiv: -0.631203 -0.1478878 -0.4354985 -0.1396196 -0.4411995 -0.3389321 -0.3743685 -0.2941142 -0.8178339 -0.563485 -0.2040388 0.147861 -0.1842464 -0.4876054 0.1712489 -0.006607 0.1000864 -0.893395 -0.5617704 -0.1514414 0.1053808 -0.0940428 -0.7628124 -0.0310761 0.0960896 -0.0409319 -0.211622 0.0842392 0.036361 -0.0087454 -0.0365744 -0.0404948 0.0006811 -0.0014285 0.0234373 0.1110282 0.0095425 0.0473631 -0.0383621 0.0428672 0.0149192 -0.0223552 -0.0395507 0.0034167 0.1355762 -0.1244662 -0.0286179 -0.0119999 0.0999912 0.0033562 0.0151013 -0.0781342 0.0291755 0.2026366 0.2233491 -0.1022032 -0.0699187 -0.1259692 0.3330292 0.0620158 -0.0608895 0.0597954 0.1812066 0.0010298 -0.0281285 -0.0294132 -0.0441159 0.0181339 0.019508 -0.0046332 0.0576537 0.1987078 0.2056013 -0.0594148 0.068077 -0.0745827 0.0272216 -0.0339826 0.0967768 -0.052074 -0.2217637 0.0812198 0.1120997 0.026355 0.101042 0.0897168 -0.033943 0.0136369 -0.0481787 -0.2463362 0.7991539 0.5163772 0.207386 0.6137405 0.5431088 0.0298856 0.2664428 0.1058956 1.3449185 0.0400278 0.0077787 0.0228076 -0.0107561 0.0319704 0.0162103 0.0207272 -0.0028951 -0.1361207 0.0487226 0.0251163 0.0058542 0.0242147 0.0530404 0.0555713 -0.0035333 -0.0121147 -0.1619371 -0.0844844 -0.1380031 0.0098998 -0.144424 -0.0530725 0.0134414 0.0278279 0.0251314 0.0597987 0.0873286 0.042671 0.0046219 -0.0001141 -0.0700416 -0.0763301 0.0227148 -0.1063805 0.0379241 0.0125551 0.068446 -0.065613 -0.0075962 0.067587 0.0342565 -0.041777 0.1009539 -0.1405311 0.0735883 -0.0019148 0.0176958 0.005555 0.0250669 0.0045044 0.0051262 0.0044872 -0.1052428 -0.0110597 0.063468 0.0413754 0.0888161 -0.1158611 -0.0815674 0.0392894 -0.1392775 0.0342842 0.0462003 -0.0854361 0.036581 -0.0192828 0.0198859 0.0640258 -0.0054717 0.1123078 -0.1288422 -0.1273556 -0.1050681 -0.0084736 -0.1201696 -0.0424283 0.009987 -0.0069815 0.0058162 0.1523235 -0.1919407 0.031376 -0.0520127 0.0424601 0.0431474 0.0137381 -0.0530366 0.0119558 0.1474933 0.2745249 0.0750163 0.041466 0.0666214 0.2227899 0.085654 0.0281759 0.0169029 0.0537834 0.0396149 0.1527631 -0.0738475 0.0586105 0.2629851 -0.04968 -0.0491885 -0.0655781 0.1627045 0.269067 -0.126682 0.0585234 -0.142425 0.2575568 0.0720371 0.1087928 0.104529 0.2412389 unknown
polarizability: 105.3095468|1.2167258|103.9130728|3.5143011|-1.8105583|76.6817932 unknown
InChI: InChI=1S/C8H13NO2/c9-7(8(10)11)6-4-2-1-3-5-6/h1-2,6-7,10H,3-5,9H2
charge 0 multiplicity 1
24 atoms
O  -2.861667 -0.914707 -1.021687
O  -2.449396 -0.758284 1.259698
N  -1.525049 1.979046 0.269481
C  0.27237 0.249637 0.152459
C  0.691081 -1.129675 -0.417722
C  1.31513 1.322266 -0.247153
C  -1.14854 0.671971 -0.308281
C  2.047091 -1.581796 0.174623
C  2.738974 0.843565 -0.029737
C  3.0698 -0.458837 0.176811
C  -2.177525 -0.397785 0.090956
H  0.25417 0.1657 1.260441
H  0.777996 -1.051281 -1.520444
H  -0.077225 -1.897845 -0.205498
H  1.127816 2.253241 0.318437
H  1.171577 1.597516 -1.315304
H  -1.159608 0.761147 -1.408765
H  2.440637 -2.444235 -0.399848
H  1.900419 -1.952452 1.211495
H  3.528432 1.608319 -0.038682
H  4.119438 -0.732868 0.353025
H  -1.608465 1.953591 1.292728
H  -2.340016 2.416711 -0.172373
H  -3.539841 -1.578247 -0.714661
