program: Gaussian 09
title: 000090893
version: EM64L-G09RevD.01
frameworkgroup: C1[X(C4H2Cl4OS)]
method: RPBEPBE
basis: SDD
operation: Freq
keyword: #p
keyword: freq=noraman
keyword: PBEPBE/SDD
title: #p freq=noraman PBEPBE/SDD
converged: NO NO NO NO
title: Mulliken charges:
elementType: Cl Cl Cl Cl S O C C C C H H
charge: 0.094369 0.094362 0.034271 0.034274 0.699743 -0.530069 -0.187154 -0.187143 -0.305309 -0.305320 0.278985 0.278990
chargesum: 0.00000
title: Mulliken charges with hydrogens summed into heavy atoms:
elementType: Cl Cl Cl Cl S O C C C C
charge: 0.094369 0.094362 0.034271 0.034274 0.699743 -0.530069 -0.187154 -0.187143 -0.026324 -0.026330
polarizability: 1.38579056e+02 2.52013924e-03 1.17563826e+02 2.53429238e-03 7.26070319e+00 8.04928552e+01
1716.lowfreq: -2.9512 -0.0033 0.0010 0.0023 2.9657 10.8457 19.7930 30.4645 57.5976
frequency: 19.3604 30.3567 57.5954 126.5377 128.6348 149.0566 155.3255 168.7493 209.2226 211.2989 268.9685 354.5757 402.8949 441.4935 473.2036 564.4459 572.2423 690.3656 705.8234 770.8750 783.6042 804.4094 820.8940 852.3945 1232.8731 1237.4203 1597.2163 1607.5378 3180.8163 3181.7700
redmass: 18.7103 22.9069 21.1647 17.0137 12.0750 11.5660 25.1216 13.2808 8.1691 16.2295 10.2097 13.1356 18.0151 6.7023 7.3726 10.1375 9.7469 11.8886 12.0486 1.2861 1.2777 6.3702 6.4905 16.9566 1.1273 1.1318 9.7824 9.8518 1.0934 1.0934
irintensity: 0.0636 0.1534 0.0762 6.1473 3.7756 0.6314 0.6425 0.0051 1.5686 3.3616 6.0516 37.4481 6.2314 26.3194 38.8875 0.1263 11.8008 28.3528 19.6646 28.4336 45.5310 23.8418 169.7649 32.6200 0.3191 6.2148 113.5380 47.1595 8.5194 7.8402
temp: 298.150 k
press: 1.00000 atm
elementType: 17 17 17 17 16 8 6 6 6 6 1 1
symmnumber: 1
zpe: 130392.7 jmol-1
zpe.correction: 0.049664 hartree
zpe.thermalcorrener: 0.062082 hartree
zpe.thermalcorrenthalpy: 0.063026 hartree
zpe.thermalcorrgfe: 0.007073 hartree
zpe.sumelectzpe: -2466.226032 hartree
zpe.sumelectthermal: -2466.213614 hartree
zpe.sumelectthermalent: -2466.212669 hartree
zpe.sumelectthermalfe: -2466.268623 hartree
dipole: 0.0002 3.7623 1.5074
dipole: 4.0530
quadrupole: -95.2154 -99.7319 -88.2238
quadrupole: 0.0005 0.0008 8.0256
quadrupole: -0.8251 -5.3415 6.1666 0.0005 0.0008 8.0256
hfenergy: -2466.275696 hartree
pointgroup: C01 [X(C4H2Cl4O1S1)]
dipole: 0.0000687 -1.4294158 -0.7067404 debye
dipolederiv: -0.1363022 0.0542919 0.2039996 0.0456258 -0.1429505 -0.2326381 0.2668006 -0.2854116 -0.3922206 -0.13617 -0.0541494 -0.2039247 -0.0455166 -0.1428565 -0.2326115 -0.2667336 -0.2853726 -0.392446 -0.6265564 -0.4204016 0.1236714 -0.3883243 -0.254664 0.036403 0.3289362 0.1828897 -0.0791139 -0.6264268 0.4203756 -0.1237445 0.3883615 -0.2546937 0.0364708 -0.3290339 0.1829844 -0.0791962 1.0389748 0.0000736 0.0000602 0.0000603 0.87672 -0.5896494 0.000103 -0.5972793 0.3394859 -0.4157264 -0.0000193 -0.0000095 -0.0000441 -0.6058485 0.3847419 -0.0000318 0.0119787 -0.2538255 -0.1748848 -0.2558009 -0.2248815 -0.3119273 -0.0624998 0.4446037 -0.2699606 0.6108014 0.4469227 -0.1750452 0.2555971 0.2247305 0.3117377 -0.0626693 0.4446173 0.2698092 0.6107996 0.4472093 0.573173 0.5658125 -0.2006917 0.5803015 0.2302058 -0.1083245 -0.2492552 -0.1994632 -0.0790482 0.5730595 -0.5658049 0.2007752 -0.5803046 0.2302565 -0.1084314 0.2493564 -0.199567 -0.0789672 0.0529197 -0.0648659 0.1120749 -0.0404533 0.0944917 -0.0376012 0.1263309 -0.0161923 0.060638 0.0529847 0.0648914 -0.1120599 0.0404833 0.0945084 -0.0375806 -0.1263211 -0.0161678 0.0605617 unknown
polarizability: 138.5790554|-0.0044398|116.2085917|0.0024382|10.055894|81.8480897 unknown
InChI: InChI=1S/C4H2Cl4OS/c5-1-3(7)10(9)4(8)2-6/h1-2H
charge 0 multiplicity 1
12 atoms
Cl -1.907562 1.081647 1.337111
Cl 1.907198 1.081273 1.337695
Cl -3.483252 -1.79502 0.314697
Cl 3.483199 -1.795181 0.315237
S  0.000166 0.79641 -1.157198
O  0.000193 2.414682 -0.863182
C  -1.459926 0.093764 -0.065179
C  1.459964 0.093641 -0.064903
C  -2.081072 -1.019667 -0.501979
C  2.081246 -1.019713 -0.501711
H  -1.77076 -1.550023 -1.405686
H  1.771204 -1.549913 -1.405602
