program: Gaussian 09
title: 000090899
version: EM64L-G09RevD.01
frameworkgroup: C1[X(C13H20O2)]
method: RPBEPBE
basis: SDD
operation: Freq
keyword: #pfreq=noraman
keyword: PBEPBE/SDD
title: #p freq=noraman PBEPBE/SDD
converged: YES YES NO NO
title: Mulliken charges:
elementType: O O C C C C C C C C C C C C C H H H H H H H H H H H H H H H H H H H H
charge: -0.320749 -0.237718 0.136257 0.335218 0.264095 -0.461674 -0.441783 -0.433355 -0.768043 -0.222655 -0.750283 -0.776053 -0.316169 0.190721 -0.782886 0.215393 0.204851 0.199338 0.204346 0.227128 0.202846 0.217141 0.253099 0.223625 0.286266 0.246529 0.225661 0.209704 0.223972 0.238520 0.213516 0.268818 0.252844 0.234415 0.237063
chargesum: 0.00000
title: Mulliken charges with hydrogens summed into heavy atoms:
elementType: O O C C C C C C C C C C C C C
charge: -0.320749 -0.237718 0.136257 0.335218 0.264095 -0.041430 -0.038100 -0.003382 -0.074178 0.063611 -0.068389 -0.100044 -0.047351 0.190721 -0.058564
polarizability: 1.86920613e+02 4.19561252e+00 1.35226854e+02 -4.27737365e+00 3.56754761e+00 1.20748176e+02
1716.lowfreq: -8.6023 -0.0010 -0.0006 -0.0005 7.8002 9.7448 38.5861 57.1753 68.5427
frequency: 38.4269 57.1162 68.5356 107.1570 115.0370 134.8789 144.3674 175.0163 206.3371 214.7856 242.0369 258.9418 296.1055 302.0555 310.3096 339.4278 353.1341 370.4913 383.6380 403.2159 432.6531 477.4173 515.5559 536.4735 555.5707 568.4397 575.4491 640.5467 698.2649 785.1612 804.4112 837.5518 861.3978 877.5592 895.3921 917.6435 931.6607 937.5162 956.8809 980.1103 993.4331 1002.6398 1007.9738 1025.5271 1038.1923 1058.0699 1083.6085 1124.7809 1141.5423 1165.2574 1175.5953 1192.7704 1204.6208 1222.0408 1252.5617 1280.8010 1291.5389 1299.7806 1335.7068 1341.9307 1354.1029 1355.8369 1367.3470 1377.3289 1390.9054 1397.0036 1442.4204 1445.3325 1454.0159 1455.8308 1464.8048 1467.8463 1469.9288 1472.1526 1474.7494 1484.3952 1490.9888 1578.2409 1647.4215 2960.5868 2968.6028 2972.5460 2978.1367 2981.0328 2985.8676 3000.3975 3021.6727 3027.6386 3060.1215 3062.1085 3064.6774 3069.1875 3072.5762 3077.6495 3094.2339 3109.3410 3111.3315 3124.1183 3134.2011
redmass: 3.4919 3.6176 4.3925 3.1130 1.0618 2.0582 2.7083 1.2334 5.1531 1.1336 2.4681 2.0721 1.7098 2.5446 2.3519 2.0066 2.1859 2.8720 2.7214 2.4106 3.1765 2.5533 4.1224 3.2200 2.2921 4.5248 2.8720 5.0804 3.8866 3.1257 3.0505 2.2280 1.6809 2.1754 2.0263 2.6455 1.5087 2.0006 1.9920 1.5433 1.6956 1.3742 1.1269 1.8594 1.8618 1.5552 1.6918 2.5829 1.8753 1.8263 1.7063 2.6181 2.4877 1.9422 2.0456 1.3726 1.6214 2.1896 2.7166 1.4159 1.6280 1.9504 1.2700 1.1905 1.2553 1.2100 1.0893 1.0852 1.0502 1.0651 1.0708 1.0925 1.0733 1.0470 1.0601 1.0522 1.0577 7.6275 6.4576 1.0617 1.0593 1.0362 1.0375 1.0360 1.0383 1.0649 1.1001 1.0955 1.0962 1.1023 1.0993 1.0982 1.0997 1.0996 1.0991 1.0890 1.0976 1.0994 1.0913
irintensity: 5.2231 0.6709 1.6609 4.0025 0.1236 0.8742 0.0984 1.0062 0.5474 0.6591 3.1685 0.1457 1.3176 1.3388 1.5235 0.2299 2.3176 2.9353 2.1693 2.3825 3.1846 0.9616 10.5736 3.4996 5.2076 20.6358 4.2031 9.2639 2.2905 4.3739 12.7195 2.6739 8.6700 0.6018 6.7266 2.4583 1.1588 1.5716 27.8160 13.9120 1.4533 14.3583 34.1097 6.2521 14.6148 9.6936 1.8134 2.1418 9.2022 2.5933 41.5876 0.9467 0.6124 0.8323 99.9167 22.6761 8.4048 113.2893 12.4531 1.5889 2.1922 13.5881 73.6688 22.2569 28.0292 8.5028 29.1437 5.8117 19.1564 1.6043 15.3831 0.7727 3.6732 8.6760 7.6758 10.6106 15.5097 193.1043 88.8855 29.8365 28.3179 30.8388 2.9704 29.3507 33.9441 34.6937 24.8785 47.9975 12.8429 28.7546 29.0626 23.9872 31.9455 57.1292 21.3172 0.9762 14.5411 18.0771 3.4650
temp: 298.150 k
press: 1.00000 atm
elementType: 8 8 6 6 6 6 6 6 6 6 6 6 6 6 6 1 1 1 1 1 1 1 1 1 1 1 1 1 1 1 1 1 1 1 1
symmnumber: 1
zpe: 783624.1 jmol-1
zpe.correction: 0.298467 hartree
zpe.thermalcorrener: 0.315042 hartree
zpe.thermalcorrenthalpy: 0.315986 hartree
zpe.thermalcorrgfe: 0.255207 hartree
zpe.sumelectzpe: -656.612874 hartree
zpe.sumelectthermal: -656.596299 hartree
zpe.sumelectthermalent: -656.595355 hartree
zpe.sumelectthermalfe: -656.656134 hartree
dipole: 2.5906 1.1038 0.4897
dipole: 2.8582
quadrupole: -92.8927 -88.4976 -95.5458
quadrupole: -4.6886 -12.0903 -3.2853
quadrupole: -0.5807 3.8144 -3.2337 -4.6886 -12.0903 -3.2853
hfenergy: -656.9113409 hartree
pointgroup: C01 [X(C13H20O2)]
dipole: 1.0499197 0.3470798 0.2041936 debye
polarizability: 186.7413852|2.4721753|133.392452|-6.6801805|5.7082157|122.7618062 unknown
InChI: InChI=1S/C13H20O2/c1-10(14)6-9-13-11(2,3)7-5-8-12(13,4)15-13/h6,9H,5,7-8H2,1-4H3
charge 0 multiplicity 1
35 atoms
O  0.696691 0.595028 1.309608
O  -3.808811 -0.363047 -1.077366
C  0.430594 -0.081033 -0.027832
C  1.107473 1.296204 0.02754
C  1.259829 -1.388089 -0.268905
C  2.621743 1.393554 -0.144926
C  2.760535 -1.082982 -0.570997
C  3.347502 0.089771 0.236533
C  0.346964 2.575016 -0.277218
C  -1.020476 -0.167357 -0.362613
C  1.133255 -2.254244 1.015655
C  0.698437 -2.193418 -1.474513
C  -2.037055 0.111173 0.50296
C  -3.467499 -0.019071 0.095031
C  -4.504531 0.281979 1.170798
H  2.98268 2.238325 0.475064
H  2.839759 1.653623 -1.201109
H  2.869244 -0.849002 -1.650839
H  3.339616 -2.00923 -0.388308
H  3.233503 -0.090824 1.321002
H  4.42934 0.190823 0.027843
H  0.545013 2.903372 -1.31465
H  -0.739321 2.44853 -0.152393
H  0.684404 3.37965 0.401923
H  -1.293735 -0.493436 -1.375829
H  1.594934 -1.748684 1.880303
H  0.072611 -2.443573 1.262897
H  1.630509 -3.2304 0.863929
H  1.36837 -3.049245 -1.678467
H  -0.309256 -2.598488 -1.273505
H  0.651343 -1.581317 -2.395136
H  -1.807771 0.432058 1.526685
H  -5.520784 0.159562 0.766486
H  -4.379356 1.31453 1.549638
H  -4.367453 -0.394759 2.036009
