program: Gaussian 09
title: 000090848
version: EM64L-G09RevD.01
frameworkgroup: C1[X(C12H22O2)]
method: RPBEPBE
basis: SDD
operation: Freq
keyword: #pfreq=noraman
keyword: PBEPBE/SDD
title: #p freq=noraman PBEPBE/SDD
converged: NO YES NO NO
title: Mulliken charges:
elementType: O O C C C C C C C C C C C C H H H H H H H H H H H H H H H H H H H H H H
charge: -0.275006 -0.261571 -0.377257 -0.371262 -0.376835 -0.352520 -0.393046 -0.356591 -0.288508 -0.695910 0.248853 -0.338843 -0.070746 -0.733917 0.193888 0.193979 0.190201 0.190112 0.194366 0.194368 0.188187 0.188109 0.212088 0.212042 0.195214 0.195226 0.225835 0.225988 0.209759 0.209761 0.215635 0.256504 0.251571 0.234317 0.231708 0.234300
chargesum: 0.00000
title: Mulliken charges with hydrogens summed into heavy atoms:
elementType: O O C C C C C C C C C C C C
charge: -0.275006 -0.261571 0.010610 0.009050 0.011900 0.023776 0.031084 0.033849 0.163314 -0.060755 0.248853 -0.082339 0.180826 -0.033592
polarizability: 2.15568654e+02 3.59734007e+00 1.21000102e+02 -1.81942582e-02 1.63866820e-02 9.80917444e+01
1716.lowfreq: -1.7844 -0.0009 0.0004 0.0009 5.7065 17.9080 20.4741 31.0981 48.0809
frequency: 19.0546 31.0865 45.6888 50.2599 83.2387 83.3698 93.4798 112.2339 136.4048 148.7161 150.4736 162.1236 173.5250 203.0306 223.7769 227.4270 241.2852 309.2881 344.1265 380.7028 421.0191 472.0705 504.5717 660.5409 706.4248 723.4279 730.9689 753.3205 793.5415 844.0093 860.0143 880.3144 890.6633 910.3406 938.4259 983.3530 991.8627 998.4374 1011.1307 1024.3727 1048.9321 1053.4862 1078.0696 1079.9354 1086.7447 1099.6869 1126.2242 1150.9450 1157.5689 1188.5509 1221.0239 1223.6229 1258.4772 1263.6835 1276.9160 1284.1414 1289.0979 1296.1028 1296.3542 1298.2191 1305.3354 1337.4679 1355.0627 1358.3751 1375.7113 1390.3380 1394.3132 1457.5591 1462.7824 1464.0122 1464.8020 1467.8800 1469.7848 1475.4500 1477.0604 1481.4906 1487.6641 1490.9694 1613.4396 1669.8192 2952.2343 2954.0128 2957.1465 2964.2346 2969.9112 2970.2304 2972.9415 2986.6697 2989.8978 2994.5873 2998.6709 3006.7459 3023.1521 3037.3997 3042.7228 3045.5622 3069.3778 3071.8317 3072.6520 3086.0706 3109.1725 3152.0893
redmass: 4.1891 3.9921 2.1459 2.9482 2.6417 2.2638 2.3725 1.9291 1.7102 3.7949 2.0930 1.7428 5.0258 1.6812 3.9227 1.1335 3.2631 3.6502 3.9314 3.8037 3.1546 3.3185 3.7928 3.3636 6.2985 1.0617 1.0800 1.1069 1.1614 1.8798 1.2097 3.8190 2.1457 2.3289 1.1969 3.7339 1.0781 4.6274 1.1134 3.6407 3.2183 1.5976 2.4305 2.2791 2.3526 2.0483 2.9735 1.4500 3.0167 1.6586 1.2858 1.3845 1.2435 1.2942 1.1149 1.0555 1.3828 1.1195 1.3963 1.0959 1.4234 1.4255 1.6119 1.6268 1.5876 1.2181 1.2329 1.0472 1.0729 1.0734 1.0712 1.0685 1.0795 1.0762 1.0422 1.0802 1.0885 1.0973 11.2004 5.8335 1.0589 1.0588 1.0592 1.0592 1.0587 1.0373 1.0365 1.0968 1.0598 1.0991 1.0566 1.1020 1.1040 1.1042 1.0957 1.1048 1.1007 1.0993 1.1074 1.0963 1.0939 1.0921
irintensity: 0.0716 0.2930 0.2780 0.9946 1.1691 1.4039 0.6050 0.6400 0.0258 0.9834 0.0095 0.4463 1.0752 0.9085 2.6937 0.0076 3.0958 6.5331 2.9662 6.9997 1.3005 2.2039 0.1948 11.2564 6.8506 14.5596 0.2055 4.1439 0.2123 2.2423 0.3519 1.7338 5.6499 6.3286 0.9587 120.3432 60.0193 54.0093 0.1481 13.2044 6.5991 0.2360 0.3819 15.3264 93.2246 94.9715 3.4631 1.2362 234.0303 0.0023 8.2086 0.0993 0.0425 0.2157 0.5080 0.4771 85.8609 0.1354 32.4969 0.1095 25.9453 1.5874 0.9655 0.0727 1.2358 11.5612 14.2256 16.7094 0.1735 0.1939 44.6459 0.1373 0.2677 2.0402 12.4303 0.6661 2.6226 31.8282 173.5465 112.8182 0.3296 1.3746 0.1590 20.5303 150.2634 19.1548 36.5218 0.0480 13.4516 0.4698 49.1207 1.3403 0.0514 61.9992 18.0729 54.5480 81.3323 54.7938 105.0330 8.7041 17.7179 8.6671
temp: 298.150 k
press: 1.00000 atm
elementType: 8 8 6 6 6 6 6 6 6 6 6 6 6 6 1 1 1 1 1 1 1 1 1 1 1 1 1 1 1 1 1 1 1 1 1 1
symmnumber: 1
zpe: 828548.6 jmol-1
zpe.correction: 0.315578 hartree
zpe.thermalcorrener: 0.333642 hartree
zpe.thermalcorrenthalpy: 0.334586 hartree
zpe.thermalcorrgfe: 0.266853 hartree
zpe.sumelectzpe: -619.775906 hartree
zpe.sumelectthermal: -619.757842 hartree
zpe.sumelectthermalent: -619.756898 hartree
zpe.sumelectthermalfe: -619.824630 hartree
dipole: -0.0284 -1.7389 -0.0042
dipole: 1.7391
quadrupole: -71.8328 -92.2217 -87.1750
quadrupole: 10.6576 0.0194 0.0061
quadrupole: 11.9104 -8.4786 -3.4318 10.6576 0.0194 0.0061
hfenergy: -620.0914834 hartree
pointgroup: C01 [X(C12H22O2)]
dipole: -0.007805 -0.6840007 -0.0152055 debye
polarizability: 215.5309055|4.0580133|121.0278876|0.212686|0.4749795|98.101707 unknown
InChI: InChI=1S/C12H22O2/c1-3-5-6-7-8-9-11-14-12(13)10-4-2/h4,10H,3,5-9,11H2,1-2H3
charge 0 multiplicity 1
36 atoms
O  -2.292362 -0.276037 -0.005671
O  -3.637836 1.636635 0.033894
C  2.71106 -0.389953 0.00316
C  4.031922 0.411843 0.01457
C  1.453507 0.507781 0.01435
C  5.29032 -0.484856 0.004095
C  0.137952 -0.305229 -0.000682
C  6.612734 0.315604 0.012902
C  -1.089858 0.604959 0.013191
C  7.863995 -0.588804 0.001984
C  -3.532142 0.382766 0.006956
C  -4.633207 -0.60618 -0.016018
C  -5.935831 -0.207622 -0.008173
C  -7.126902 -1.126153 -0.030081
H  2.686858 -1.04384 -0.893405
H  2.685536 -1.067098 0.882212
H  4.05609 1.066253 0.91106
H  4.057459 1.089275 -0.864634
H  1.481492 1.186473 -0.863517
H  1.478102 1.159329 0.912648
H  5.267375 -1.161013 0.884428
H  5.266975 -1.141217 -0.891128
H  0.103964 -0.948576 -0.900974
H  0.101644 -0.978236 0.877566
H  6.635347 0.970701 0.907788
H  6.634687 0.991462 -0.866406
H  -1.127845 1.271055 -0.869283
H  -1.131626 1.238488 0.919151
H  7.87992 -1.231428 -0.898606
H  7.879766 -1.25307 0.886706
H  8.795723 0.006188 0.009286
H  -4.345401 -1.662539 -0.039439
H  -6.129506 0.875593 0.016167
H  -7.764849 -0.959197 0.859857
H  -6.832736 -2.188972 -0.054492
H  -7.76373 -0.918184 -0.912161
