program: Gaussian 09
title: 000090840
version: EM64L-G09RevD.01
frameworkgroup: C1[X(C8H14O2)]
method: RPBEPBE
basis: SDD
operation: Freq
keyword: #pfreq=noraman
keyword: PBEPBE/SDD
title: #p freq=noraman PBEPBE/SDD
converged: YES YES NO NO
title: Mulliken charges:
elementType: O O C C C C C C C C H H H H H H H H H H H H H H
charge: -0.217358 -0.215271 -0.153040 -0.445413 -0.428515 -0.440929 -0.304395 0.196057 -0.364999 -0.694464 0.238116 0.227876 0.230887 0.225437 0.209178 0.240042 0.215201 0.239226 0.199241 0.209782 0.189881 0.213326 0.214663 0.215468
chargesum: 0.00000
title: Mulliken charges with hydrogens summed into heavy atoms:
elementType: O O C C C C C C C C
charge: -0.217358 -0.215271 0.085077 0.013350 0.006100 0.014314 0.134073 0.196057 0.034665 -0.051007
polarizability: 1.05079983e+02 6.88100270e+00 8.99034431e+01 -2.46251076e+00 -2.83612427e+00 7.14049456e+01
1716.lowfreq: -4.7899 -0.0010 -0.0007 0.0004 12.4497 16.3940 67.8297 74.2323 100.7843
frequency: 67.8203 74.1287 100.7648 105.9440 136.3053 230.3886 268.2061 294.7260 305.6723 343.4330 450.7827 476.1661 523.4045 587.7046 662.6258 727.5503 748.4584 834.3520 850.8269 878.4920 901.7376 919.4238 943.7498 1019.7949 1030.0965 1039.8789 1076.8844 1090.5143 1101.9760 1134.6649 1139.8916 1176.5156 1215.3215 1224.9692 1246.7141 1273.7618 1281.9911 1295.5767 1309.8202 1331.4908 1343.5047 1350.7490 1361.4966 1392.9988 1459.0724 1463.4000 1474.0428 1477.2585 1479.8929 1483.5120 1487.7164 1667.4448 2936.7097 2962.5603 2975.2541 2988.3191 2989.9790 2996.8814 3008.4787 3011.8752 3049.5326 3052.1333 3072.4599 3074.3138 3075.0323 3100.0958
redmass: 2.1651 2.0285 2.5608 3.2158 3.3082 1.1138 2.7160 3.2905 2.9122 2.9515 6.4485 3.2340 5.9467 2.4897 3.6834 1.3993 1.7662 1.3795 2.1231 2.9405 1.7883 2.5819 1.6820 1.8697 2.4601 3.0495 2.2033 2.6161 2.1752 2.5054 2.0243 1.3408 1.3656 1.2557 1.3307 1.2158 1.1707 1.1905 1.2532 1.4964 1.4036 1.3031 1.6021 1.2131 1.0791 1.0761 1.0641 1.0422 1.0812 1.0858 1.0795 11.8389 1.0806 1.0601 1.0363 1.0622 1.0673 1.0601 1.0860 1.0725 1.1029 1.1017 1.1006 1.1018 1.1007 1.0999
irintensity: 0.2686 0.7295 0.1434 1.7422 2.5680 0.0231 0.4503 5.2183 3.4294 5.4265 1.4111 1.1284 1.0059 8.2500 2.3677 9.0287 3.1317 2.4193 17.2913 7.9502 10.1709 9.7258 0.2743 95.9489 38.3413 29.2684 4.5634 88.9358 11.6933 8.9918 1.8044 5.5909 4.0731 20.7026 20.2770 9.9767 0.4772 0.3579 3.0974 5.1831 1.6300 3.1606 0.5094 11.8652 7.0107 2.3113 2.9248 14.0561 13.1719 2.4445 12.7385 256.1431 11.0436 29.4570 32.9663 18.3496 56.7562 27.9649 3.7113 41.1271 1.6933 18.0239 74.9125 26.4994 77.0369 32.3519
temp: 298.150 k
press: 1.00000 atm
elementType: 8 8 6 6 6 6 6 6 6 6 1 1 1 1 1 1 1 1 1 1 1 1 1 1
symmnumber: 1
zpe: 545241.4 jmol-1
zpe.correction: 0.207671 hartree
zpe.thermalcorrener: 0.218358 hartree
zpe.thermalcorrenthalpy: 0.219302 hartree
zpe.thermalcorrgfe: 0.171012 hartree
zpe.sumelectzpe: -462.891050 hartree
zpe.sumelectthermal: -462.880364 hartree
zpe.sumelectthermalent: -462.879420 hartree
zpe.sumelectthermalfe: -462.927710 hartree
dipole: 0.6115 -5.1795 1.0666
dipole: 5.3235
quadrupole: -60.2397 -70.2186 -59.4726
quadrupole: 7.9123 -1.0558 1.6220
quadrupole: 3.0706 -6.9083 3.8377 7.9123 -1.0558 1.6220
hfenergy: -463.0987219 hartree
pointgroup: C01 [X(C8H14O2)]
dipole: -0.3294046 2.0304748 0.3939733 debye
dipolederiv: -1.1260837 -0.5512274 -0.2099754 -0.2036119 -0.6995371 -0.0600889 -0.1561005 -0.114446 -0.3759944 -0.6333009 -0.079703 -0.0476352 -0.2133238 -1.0497357 -0.1774991 -0.0983843 -0.2437688 -0.3660058 -0.1304569 0.0740956 0.0132 0.1766873 -0.198551 -0.0413648 0.0647333 -0.08357 0.1762954 -0.0046537 -0.0104538 0.0067305 -0.0453131 0.1092624 0.0238701 0.0056052 0.0305481 0.1066144 0.0459822 -0.0024481 -0.0045346 0.0076921 0.0405685 -0.0161338 0.0122446 -0.0061271 0.1318068 0.0055325 0.0237883 -0.056036 -0.0276794 0.0144958 0.057875 -0.0879683 0.0565774 0.0256707 0.3084954 0.0771729 0.001222 0.2195747 0.5601267 0.0761934 0.0502797 0.0366876 0.3580647 1.4106555 0.4482335 0.2372818 0.1860273 1.2790879 0.3015272 0.1930485 0.4303105 0.2889861 0.0220435 0.0024908 -0.0059821 -0.027364 0.0987784 -0.0297205 -0.0327398 -0.0345112 0.1656265 -0.0569457 -0.023792 -0.0145117 0.0017839 0.0720821 -0.0092734 0.0043655 -0.009197 0.0842775 0.0599009 0.018141 -0.0283634 -0.0030904 0.0414125 -0.0321531 -0.0356138 -0.0139149 -0.1231608 -0.0053592 0.0830666 0.038091 0.1169035 -0.0727006 -0.0437003 0.0588053 -0.0653949 0.0308501 0.0216712 0.0125169 -0.081118 -0.0138669 0.0547158 -0.0250927 -0.090915 0.0282538 -0.1063256 0.0451473 -0.0377197 0.0215111 -0.055063 -0.0844651 0.0735108 0.0117684 0.0811798 0.036432 0.032484 0.0050927 0.0048553 0.0069537 0.0666775 -0.0191627 -0.0087135 -0.0434148 -0.1443476 -0.0122422 0.0039977 0.050922 0.0417495 0.0848503 -0.0570481 0.080469 -0.0055319 -0.0984204 0.0414644 -0.0389927 -0.0038686 -0.0997084 -0.1684542 -0.0245461 -0.0174388 -0.0306889 0.0892685 -0.1555945 -0.045405 -0.0428384 -0.0229754 0.0355621 -0.0094727 -0.0034236 -0.0034292 0.0923104 0.065899 0.0250979 0.1165766 -0.0430069 -0.0395058 -0.0316475 0.0362096 -0.0526137 -0.145842 0.0406084 -0.0501132 0.0211103 -0.0355356 -0.1477282 0.0836029 0.024056 0.106108 0.0180388 0.0213761 -0.0123853 -0.058651 0.0018541 0.0497627 -0.0510497 -0.0277267 -0.0744321 -0.1835806 0.0711155 -0.0094671 0.0046474 -0.0336873 0.078059 -0.0434247 -0.0614466 -0.0514227 -0.1665934 0.0637794 -0.0115784 -0.0060037 -0.0809469 -0.1107693 0.1049447 0.0170366 0.1130234 0.0280731 -0.1315185 0.0995919 0.0433699 0.145947 -0.0139945 -0.0501459 0.0618495 -0.0502255 0.0779556 unknown
polarizability: 104.4291846|7.4836739|90.5638327|2.6152702|2.8071925|71.3953547 unknown
InChI: InChI=1S/C8H14O2/c1-2-4-7-5-3-6-10-8(7)9/h7H,2-6H2,1H3
charge 0 multiplicity 1
24 atoms
O  2.261851 -0.652858 0.279797
O  0.696881 -2.196318 -0.350455
C  -0.121613 0.067804 0.254898
C  0.275073 1.397283 -0.471348
C  -1.537897 -0.429158 -0.110953
C  1.808726 1.661039 -0.44254
C  2.490522 0.781693 0.614633
C  0.926825 -1.028194 0.016295
C  -2.662239 0.544202 0.309898
C  -4.066457 -0.019521 0.00325
H  -0.095012 0.271829 1.349233
H  -0.26949 2.229293 0.009698
H  -0.080232 1.345921 -1.51696
H  -1.704763 -1.413584 0.365962
H  -1.584776 -0.611384 -1.203001
H  2.25959 1.418975 -1.422182
H  2.027683 2.725396 -0.2373
H  3.586069 0.891026 0.616497
H  2.105489 0.985853 1.633518
H  -2.539693 1.516641 -0.207282
H  -2.577918 0.753802 1.396792
H  -4.186816 -0.214566 -1.078954
H  -4.234474 -0.974965 0.534674
H  -4.86143 0.684194 0.310829
