program: Gaussian 09
title: 000090839
version: EM64L-G09RevD.01
frameworkgroup: C1[X(C14H14O2)]
method: RPBEPBE
basis: SDD
operation: Freq
keyword: #pfreq=noraman
keyword: PBEPBE/SDD
title: #p freq=noraman PBEPBE/SDD
converged: YES YES NO NO
title: Mulliken charges:
elementType: O O C C C C C C C C C C C C C C H H H H H H H H H H H H H H
charge: -0.465599 -0.285894 -0.352968 0.317975 0.450106 0.171307 -0.358423 -0.430750 -0.361637 -0.362744 -0.250664 -0.237155 -0.225204 -0.221045 -0.244245 -0.535915 0.229246 0.283771 0.233103 0.254407 0.236616 0.224574 0.222221 0.224526 0.224746 0.346947 0.227196 0.221609 0.223711 0.240182
chargesum: 0.00000
title: Mulliken charges with hydrogens summed into heavy atoms:
elementType: O O C C C C C C C C C C C C C C
charge: -0.118652 -0.285894 -0.123722 0.317975 0.450106 0.171307 -0.074652 -0.197647 -0.107230 -0.126128 -0.026090 -0.014934 -0.000677 0.003701 -0.017050 0.149587
polarizability: 1.79130324e+02 1.87693341e+01 1.59980617e+02 5.35925970e+00 1.18857687e+01 1.14109473e+02
1716.lowfreq: -10.8391 -7.0159 -3.2222 -0.0006 -0.0002 0.0002 14.5850 36.1458 54.5163
frequency: 13.1671 36.0890 54.5032 104.0571 140.4607 163.0331 181.1242 227.5446 253.5298 259.6180 284.1992 302.6531 326.7584 380.1136 401.0486 446.7236 476.6523 522.9230 555.2233 567.5458 590.0795 615.4407 642.9725 701.1195 725.1338 754.0731 758.4320 772.3444 816.1165 835.5595 850.2731 858.8472 921.0353 947.9357 966.2820 973.6433 985.0686 989.7364 990.4458 993.8214 1024.6907 1041.7741 1079.0574 1098.7928 1113.6547 1148.5510 1165.4349 1170.0812 1170.8828 1179.6803 1187.2389 1201.5153 1231.7252 1268.8791 1287.6030 1331.3956 1359.2633 1386.9008 1394.3903 1429.3700 1441.3234 1445.7653 1467.7579 1470.9849 1478.9915 1487.0260 1594.1877 1598.1899 1606.2359 1610.7645 2960.9465 2977.9421 3049.2285 3118.6693 3122.8628 3125.4969 3128.9194 3137.4945 3147.9832 3148.2279 3162.5648 3163.5040 3174.9767 3569.6799
redmass: 3.8522 4.3625 4.9279 3.3081 4.0392 4.4569 3.6824 2.2613 1.7784 3.9064 1.6348 2.9410 2.2055 4.7919 2.7980 3.5109 5.6160 3.7745 4.2342 4.4162 5.1228 6.3077 5.4590 1.7208 3.2256 3.3182 1.4392 2.6343 2.9842 3.5167 1.2596 1.5943 1.4816 1.3735 5.9434 1.4140 1.3642 6.8431 5.8985 1.3548 2.1930 2.1192 1.5911 2.3122 1.2593 1.4842 1.3532 1.1260 1.0819 1.3352 1.6178 1.6656 2.4287 1.3734 1.4167 1.2545 1.7663 7.2334 5.4463 1.4976 2.1186 1.6363 1.0519 1.2551 2.2788 1.8752 6.1091 7.2155 6.5113 6.2403 1.0327 1.0841 1.1039 1.0852 1.0994 1.0872 1.0857 1.0919 1.0960 1.0908 1.1014 1.0947 1.0973 1.0661
irintensity: 0.1984 0.0855 0.7246 5.7932 1.9231 1.2437 1.2659 3.1740 0.6754 11.9935 79.6592 13.3014 64.2974 2.5839 0.2936 0.9535 1.5362 8.0460 14.2498 1.6571 22.4865 1.4473 13.8737 58.0249 10.1233 38.3288 94.1270 25.3501 4.2067 6.4005 0.9951 0.6738 3.9549 4.4468 69.9055 2.0917 0.4373 34.8565 9.3402 0.1573 6.5556 16.6574 8.8249 15.8260 0.0982 7.6388 61.2732 4.1803 2.3419 2.6556 2.4617 45.2259 80.8749 5.2808 13.3921 1.3160 28.8828 1.1404 5.5379 22.6235 11.5602 15.7337 12.8384 74.3004 11.3243 19.4690 0.5171 15.1503 13.3010 7.5703 67.1945 24.9688 44.8242 3.8335 21.3806 0.6221 2.5275 20.2437 33.3236 22.8713 25.1407 16.6314 10.9320 6.8443
temp: 298.150 k
press: 1.00000 atm
elementType: 8 8 6 6 6 6 6 6 6 6 6 6 6 6 6 6 1 1 1 1 1 1 1 1 1 1 1 1 1 1
symmnumber: 1
zpe: 633099.3 jmol-1
zpe.correction: 0.241135 hartree
zpe.thermalcorrener: 0.255548 hartree
zpe.thermalcorrenthalpy: 0.256492 hartree
zpe.thermalcorrgfe: 0.198167 hartree
zpe.sumelectzpe: -691.165873 hartree
zpe.sumelectthermal: -691.151460 hartree
zpe.sumelectthermalent: -691.150516 hartree
zpe.sumelectthermalfe: -691.208841 hartree
dipole: 0.5627 2.4930 -0.7505
dipole: 2.6636
quadrupole: -85.3382 -82.7728 -93.3439
quadrupole: -4.1596 4.3254 3.4322
quadrupole: 1.8135 4.3788 -6.1923 -4.1596 4.3254 3.4322
hfenergy: -691.4070079 hartree
pointgroup: C01 [X(C14H14O2)]
dipole: 0.0794763 -0.9684762 0.3923267 debye
polarizability: 172.3616034|-20.7002287|168.4826747|-4.2442596|8.0823415|112.3761365 unknown
InChI: InChI=1S/C14H14O2/c1-16-13-10-6-5-9-12(13)14(15)11-7-3-2-4-8-11/h2-10,14-15H,1H3
charge 0 multiplicity 1
30 atoms
O  0.492183 1.6234 -2.095996
O  -1.27861 -1.727738 -0.323415
C  0.20217 0.375928 -1.352704
C  -1.043172 0.642632 -0.515661
C  1.416228 -0.03737 -0.51246
C  -1.776832 -0.455175 0.016989
C  -1.489766 1.951101 -0.238705
C  2.048401 -1.284814 -0.729595
C  1.944534 0.845543 0.464268
C  -2.919631 -0.242756 0.822793
C  -2.633574 2.177358 0.563287
C  -3.341693 1.079554 1.09552
C  3.193495 -1.648983 0.015724
C  3.088269 0.485111 1.208057
C  3.716924 -0.76416 0.985925
C  -1.983378 -2.897788 0.202155
H  -0.016789 -0.44372 -2.067386
H  -0.937555 2.783643 -0.683378
H  1.634025 -1.974523 -1.474977
H  1.451438 1.808626 0.637592
H  -3.481641 -1.085848 1.235527
H  -2.967769 3.200561 0.764775
H  -4.22766 1.242765 1.719591
H  3.674859 -2.617997 -0.158823
H  3.489664 1.172907 1.961185
H  1.395066 1.538025 -2.493899
H  4.60454 -1.044295 1.564608
H  -3.028813 -2.936099 -0.161641
H  -1.974957 -2.908037 1.309208
H  -1.425457 -3.765551 -0.179766
