program: Gaussian 09
title: 000090830
version: EM64L-G09RevD.01
frameworkgroup: C1[X(C14H20O)]
method: RPBEPBE
basis: SDD
operation: Freq
keyword: #pfreq=noraman
keyword: PBEPBE/SDD
title: #p freq=noraman PBEPBE/SDD
converged: YES YES NO NO
title: Mulliken charges:
elementType: O C C C C C C C C C C C C C C H H H H H H H H H H H H H H H H H H H H
charge: -0.183706 -0.201431 -0.338442 -0.199609 0.212780 0.231710 -0.469426 0.093984 -0.445144 -0.417335 -0.524844 -0.532297 -0.413941 -0.418253 -0.757495 0.239253 0.246448 0.201922 0.211043 0.218795 0.222509 0.213507 0.227210 0.211137 0.224032 0.212753 0.214988 0.215341 0.206228 0.206567 0.199719 0.205277 0.218731 0.243463 0.224526
chargesum: 0.00000
title: Mulliken charges with hydrogens summed into heavy atoms:
elementType: O C C C C C C C C C C C C C C
charge: -0.183706 0.037822 -0.091994 0.002313 0.212780 0.231710 -0.039588 0.093984 -0.009127 0.021012 -0.088059 -0.101968 -0.001146 -0.013257 -0.070775
polarizability: 1.51948469e+02 -2.64214485e-01 1.47514003e+02 -2.58077770e+00 -4.85504131e+00 1.25810887e+02
1716.lowfreq: -9.8693 -0.0006 -0.0005 0.0001 10.4398 20.5251 63.0461 83.8369 88.8871
frequency: 62.3889 83.8147 88.7334 102.6441 170.9400 213.1291 220.2418 252.4065 272.8291 292.4202 308.3362 351.3931 392.1801 402.4955 425.4246 464.3593 473.5397 488.8232 521.3618 597.1952 615.4557 651.2668 702.7964 743.1965 787.2496 811.7376 825.9096 840.8705 861.6284 882.5173 896.4727 901.5816 917.2634 949.4368 965.7986 1006.3171 1022.7705 1033.2585 1058.6931 1070.6163 1079.4526 1081.5978 1094.5826 1100.8832 1120.7367 1129.9627 1144.6356 1160.8071 1169.6378 1176.0476 1224.5472 1241.6073 1243.5493 1251.7321 1260.7473 1269.6616 1274.8076 1299.9902 1309.9111 1325.9149 1330.4582 1339.7355 1343.3712 1346.8281 1350.3373 1355.5401 1359.1813 1390.7947 1451.5597 1457.1312 1461.8331 1464.3776 1468.9704 1473.0934 1474.7711 1477.6841 1480.9669 1639.4109 1680.0388 2925.4266 2939.3262 2947.5266 2970.1811 2974.4823 2976.1677 2977.4860 2980.1247 2993.8875 2995.9454 2997.3888 3019.3946 3025.1300 3027.1772 3034.2163 3039.3038 3047.3027 3053.7839 3075.4210 3082.6221
redmass: 3.5360 4.0315 2.7037 3.1868 2.4924 1.4844 2.0648 2.7136 2.0180 2.3202 1.8099 2.5598 2.8220 4.8476 3.8293 3.0490 3.0390 3.1568 2.7124 3.7336 3.8300 2.8235 2.4471 3.1438 3.0556 2.1803 1.4901 2.5302 2.4731 1.6402 2.2229 1.5925 2.0162 2.5766 2.7541 1.8585 2.1047 1.7625 2.4329 1.6355 1.6807 1.6706 2.2048 1.8370 1.2869 1.9284 2.1935 1.4076 1.4877 1.6662 1.5880 1.8032 1.4043 1.4243 1.3822 1.2079 1.2276 1.3670 1.5845 1.4282 1.3893 1.5419 1.5900 1.4839 1.5457 1.5023 1.8082 1.2031 1.0971 1.0791 1.0844 1.0785 1.0865 1.0892 1.0806 1.0706 1.0463 9.5234 7.4636 1.0824 1.0643 1.0605 1.0602 1.0687 1.0612 1.0670 1.0357 1.0637 1.0891 1.0895 1.0853 1.0884 1.0982 1.1006 1.0983 1.1041 1.1029 1.0997 1.0998
irintensity: 0.7871 1.3527 0.3151 0.7442 1.6490 0.2642 0.3807 0.4717 0.0759 1.0957 0.6554 0.6505 3.2478 1.3121 2.0336 1.4630 3.0748 4.0729 2.4328 0.5684 0.7486 0.7633 5.2038 1.5034 5.5536 0.3955 7.0201 2.5481 3.9267 1.9714 1.8343 5.1596 3.4094 6.5003 1.4217 0.4171 5.5060 5.6616 1.8473 1.4421 11.1829 2.5471 0.0661 0.2403 2.5896 2.2822 1.9108 1.1383 4.0433 0.9947 1.2899 8.8599 2.0601 11.6788 5.3771 5.5460 1.8702 4.7435 6.4137 2.3626 2.3913 0.1863 4.2763 2.8408 0.6625 2.2172 4.2936 13.9102 0.4670 7.0554 11.6304 11.4201 9.7564 19.3616 4.1925 1.7522 11.2045 199.9941 0.5255 32.8941 37.8204 42.0012 35.9317 23.7960 36.0361 19.6379 30.0758 28.2809 81.9236 13.3292 52.0643 35.5919 18.9448 16.0485 70.4945 67.7022 60.2290 37.4505 31.0461
temp: 298.150 k
press: 1.00000 atm
elementType: 8 6 6 6 6 6 6 6 6 6 6 6 6 6 6 1 1 1 1 1 1 1 1 1 1 1 1 1 1 1 1 1 1 1 1
symmnumber: 1
zpe: 808189.2 jmol-1
zpe.correction: 0.307823 hartree
zpe.thermalcorrener: 0.321338 hartree
zpe.thermalcorrenthalpy: 0.322282 hartree
zpe.thermalcorrgfe: 0.268490 hartree
zpe.sumelectzpe: -619.558810 hartree
zpe.sumelectthermal: -619.545295 hartree
zpe.sumelectthermalent: -619.544351 hartree
zpe.sumelectthermalfe: -619.598142 hartree
dipole: 2.2218 -0.2524 -3.1750
dipole: 3.8834
quadrupole: -93.7767 -86.7020 -97.9595
quadrupole: 0.1946 9.1032 -0.9948
quadrupole: -0.9640 6.1108 -5.1468 0.1946 9.1032 -0.9948
hfenergy: -619.8666328 hartree
pointgroup: C01 [X(C14H20O1)]
dipole: -0.8850106 -0.1177995 1.2398401 debye
polarizability: 151.9913839|0.2633499|147.3853471|-2.3560355|5.13216|125.8966278 unknown
InChI: InChI=1S/C14H20O/c1-9-10-5-2-3-6-12(10)13-8-4-7-11(9)14(13)15/h9,11,13H,2-8H2,1H3
charge 0 multiplicity 1
35 atoms
O  2.344447 0.006273 -2.047068
C  1.7960 0.844863 0.202095
C  0.669507 -1.214834 -0.724391
C  0.413043 1.544053 0.450111
C  -0.69384 -0.593828 -0.399195
C  -0.797211 0.640652 0.180487
C  2.299162 0.018322 1.4318
C  1.675532 -0.101821 -0.984589
C  1.20143 -2.081406 0.475588
C  1.415716 -1.214971 1.737144
C  -1.899343 -1.470237 -0.717159
C  -2.150932 1.217267 0.593198
C  -3.249611 -0.731364 -0.58351
C  -3.258845 0.145235 0.686542
C  0.326112 2.849508 -0.393213
H  2.549454 1.617477 -0.038428
H  0.598251 -1.84972 -1.627385
H  0.380424 1.84334 1.52225
H  2.347612 0.685344 2.314913
H  3.33565 -0.315895 1.223182
H  2.157527 -2.551697 0.169874
H  0.487255 -2.901538 0.681474
H  0.433528 -0.883479 2.122918
H  1.885973 -1.821959 2.53445
H  -1.789382 -1.872117 -1.745161
H  -1.890135 -2.359663 -0.049544
H  -2.040983 1.740708 1.565777
H  -2.462261 1.998382 -0.132394
H  -3.404721 -0.082761 -1.468748
H  -4.081282 -1.460775 -0.566214
H  -3.085042 -0.494635 1.575136
H  -4.244998 0.628933 0.820884
H  1.152188 3.53552 -0.130625
H  0.399299 2.622119 -1.472362
H  -0.623424 3.385405 -0.218136
