program: Gaussian 09
title: 000090811
version: EM64L-G09RevD.01
frameworkgroup: C1[X(C10H20O)]
method: RPBEPBE
basis: SDD
operation: Freq
keyword: #pfreq=noraman
keyword: PBEPBE/SDD
title: #p freq=noraman PBEPBE/SDD
converged: YES YES NO NO
title: Mulliken charges:
elementType: O C C C C C C C C C C H H H H H H H H H H H H H H H H H H H H
charge: -0.474730 -0.469646 -0.357244 0.237409 -0.363584 -0.356392 -0.355663 -0.738309 -0.116018 -0.696343 -0.576598 0.199226 0.195585 0.214540 0.211538 0.183961 0.185150 0.189981 0.190052 0.193335 0.193916 0.248828 0.200694 0.214913 0.219820 0.329984 0.210052 0.214252 0.210247 0.204827 0.256218
chargesum: 0.00000
title: Mulliken charges with hydrogens summed into heavy atoms:
elementType: O C C C C C C C C C C
charge: -0.144745 -0.074834 0.068834 0.237409 0.005526 0.023640 0.031588 -0.073875 0.103802 -0.061793 -0.115553
polarizability: 1.24790073e+02 3.28655778e+00 1.15242255e+02 -2.82080484e-01 2.61366738e+00 9.62342481e+01
1716.lowfreq: -12.9978 -11.0114 -0.0008 -0.0006 0.0005 7.7948 36.7515 52.8854 56.1083
frequency: 36.1169 52.5453 55.0327 87.3439 100.4959 117.8072 149.4330 175.3871 219.3413 223.2630 225.4937 250.1359 270.9358 304.8275 309.9527 397.4567 404.3049 432.3841 502.4886 557.5798 685.0835 724.1210 728.5585 740.8822 785.5801 859.6582 884.0150 896.5624 914.4580 952.9282 975.7484 994.3203 996.2668 1008.6528 1030.5552 1066.0456 1072.2021 1075.8309 1083.6219 1124.5181 1148.2087 1172.7382 1192.7863 1228.8225 1240.1887 1273.5083 1281.5929 1285.3803 1289.4988 1293.0074 1328.8199 1335.5689 1353.0885 1354.7976 1377.1358 1386.7098 1414.6155 1451.5721 1462.5251 1463.2028 1465.6616 1470.5951 1474.5563 1475.2422 1483.3422 1489.4516 1659.2036 2943.4924 2947.5093 2955.3735 2966.5541 2969.4450 2970.9252 2983.2075 2984.9541 3000.7168 3004.6575 3028.2799 3050.4008 3062.3273 3067.3723 3069.5837 3082.7854 3095.5769 3107.8924 3216.4677 3558.5838
redmass: 2.9152 2.0199 2.6651 2.9369 2.4487 1.7154 2.1151 3.0837 1.0684 1.2776 2.3063 1.1770 2.7355 2.6392 1.9700 2.8104 2.7242 2.8275 2.7705 2.8587 1.9686 1.1166 3.1097 1.1189 1.2354 1.4842 1.9419 1.6462 1.7029 1.3648 1.2463 2.0546 1.1183 1.7947 3.4072 1.7473 1.7745 2.1329 2.0373 2.5130 1.9183 2.7092 1.6407 1.3222 1.3565 1.2028 1.3067 1.0874 1.1647 1.2436 1.4472 1.4834 1.6076 1.5964 1.2174 1.2168 1.2390 1.0786 1.0568 1.0641 1.0749 1.0817 1.0700 1.0434 1.0810 1.0922 5.2435 1.0611 1.0594 1.0587 1.0590 1.0375 1.0365 1.0654 1.0912 1.0985 1.0991 1.1041 1.1034 1.0971 1.1006 1.0993 1.0770 1.0986 1.0758 1.1145 1.0658
irintensity: 0.0212 0.0925 0.0392 3.5809 0.0182 0.0253 0.0863 10.3430 9.4073 0.3446 1.1232 100.7434 11.3806 5.3788 38.4550 3.4552 3.0760 0.5686 0.3873 5.6284 17.0533 7.8092 7.8817 0.3364 1.7781 15.1746 4.5343 21.2308 1.5370 67.5089 0.8601 18.7003 34.0584 17.8359 5.3839 2.3085 1.8560 3.8076 1.4416 19.5451 36.3746 47.5267 7.0750 10.7359 4.1980 2.2212 2.4277 0.6984 0.4793 1.9946 1.1152 3.8024 3.0677 1.3516 16.4268 10.8533 23.6851 0.2416 7.3716 1.5489 0.9298 5.9335 2.1973 12.2371 1.2380 23.1219 7.8121 9.0297 29.5920 7.7300 79.3182 41.8206 32.0999 43.4060 10.8576 8.4794 6.6329 28.8676 63.5070 44.2164 102.0921 55.8578 13.0617 28.2512 16.6318 12.1025 4.3945
temp: 298.150 k
press: 1.00000 atm
elementType: 8 6 6 6 6 6 6 6 6 6 6 1 1 1 1 1 1 1 1 1 1 1 1 1 1 1 1 1 1 1 1
symmnumber: 1
zpe: 726072.6 jmol-1
zpe.correction: 0.276546 hartree
zpe.thermalcorrener: 0.291333 hartree
zpe.thermalcorrenthalpy: 0.292277 hartree
zpe.thermalcorrgfe: 0.234292 hartree
zpe.sumelectzpe: -467.338717 hartree
zpe.sumelectthermal: -467.323931 hartree
zpe.sumelectthermalent: -467.322986 hartree
zpe.sumelectthermalfe: -467.380971 hartree
dipole: -0.2876 -1.8497 -0.6800
dipole: 1.9916
quadrupole: -75.0180 -69.1315 -68.3007
quadrupole: -3.6763 -1.9843 -3.3462
quadrupole: -4.2013 1.6852 2.5161 -3.6763 -1.9843 -3.3462
hfenergy: -467.615263 hartree
pointgroup: C01 [X(C10H20O1)]
dipole: 0.1189282 -0.7064846 0.3173395 debye
polarizability: 124.8452955|-3.2101445|114.7351622|-0.0006954|-3.9034551|96.6861183 unknown
InChI: InChI=1S/C10H20O/c1-4-6-7-8-9-10(3,11)5-2/h5,11H,2,4,6-9H2,1,3H3
charge 0 multiplicity 1
31 atoms
O  -2.34268 -0.150813 -1.486586
C  -0.890319 -0.918425 0.382454
C  0.283824 0.014273 0.01912
C  -2.295952 -0.377772 -0.021684
C  1.66104 -0.642658 0.263701
C  2.847877 0.286584 -0.077216
C  4.226742 -0.37788 0.14059
C  -3.397199 -1.398162 0.37018
C  -2.581805 0.959502 0.641876
C  5.407889 0.553683 -0.207526
C  -2.913628 2.102948 -0.002171
H  -0.886604 -1.118554 1.473697
H  -0.745577 -1.903156 -0.113973
H  0.19084 0.308898 -1.044597
H  0.209892 0.950873 0.60625
H  1.739166 -1.569614 -0.343693
H  1.739323 -0.960919 1.325138
H  2.78388 1.207233 0.539833
H  2.763604 0.616132 -1.133917
H  4.286794 -1.299015 -0.474893
H  4.310531 -0.704976 1.197387
H  -4.376772 -1.049403 0.00133
H  -3.183438 -2.393484 -0.067668
H  -3.460379 -1.520238 1.466935
H  -2.512918 0.940452 1.740296
H  -2.21903 -1.02624 -1.934161
H  5.387306 1.46901 0.413965
H  6.381125 0.055305 -0.042857
H  5.364322 0.868904 -1.267296
H  -3.120924 3.02748 0.549059
H  -2.979631 2.126728 -1.093973
