program: Gaussian 09
title: 000090799
version: EM64L-G09RevD.01
frameworkgroup: C1[X(C11H13BrN2O4)]
method: RPBEPBE
basis: SDD
operation: Freq
keyword: #p
keyword: freq=noraman
keyword: PBEPBE/SDD
title: #p freq=noraman PBEPBE/SDD
converged: NO NO NO NO
title: Mulliken charges:
elementType: Br O O O O N N C C C C C C C C C C C H H H H H H H H H H H H H
charge: 0.079943 -0.301499 -0.167965 -0.178854 -0.271226 0.144176 -0.456819 -0.154967 -0.339496 -0.312294 -0.709656 0.271770 0.482354 -0.441346 -0.352951 -0.194084 -0.209115 -0.252987 0.245274 0.267311 0.287576 0.277975 0.231301 0.267126 0.232091 0.340445 0.225856 0.297053 0.230430 0.229917 0.232662
chargesum: 0.00000
title: Mulliken charges with hydrogens summed into heavy atoms:
elementType: Br O O O O N N C C C C C C C C C C C
charge: 0.079943 -0.301499 -0.167965 -0.178854 -0.271226 0.144176 -0.116374 -0.154967 0.173089 0.253256 0.020862 0.271770 0.482354 -0.215490 -0.055898 0.036345 0.020802 -0.020325
polarizability: 2.28868375e+02 6.64219599e-01 1.69693531e+02 1.29922518e+01 4.48470444e+00 1.05781333e+02
1716.lowfreq: -4.1672 0.0007 0.0008 0.0010 1.9753 10.3337 21.7710 27.8789 37.8240
frequency: 21.6768 27.8250 37.8056 49.7265 74.7074 83.7595 109.3258 131.7438 138.1364 160.2571 200.8550 215.9651 230.2062 248.1917 262.7288 305.3408 319.9463 332.1683 355.5693 407.1680 408.2155 486.6184 508.7110 529.1275 602.1727 612.7811 628.1720 650.9305 679.6468 693.9740 696.4469 698.6398 760.1827 768.1383 805.8074 829.8534 842.9167 862.5644 907.4360 916.5398 974.2665 984.4463 985.8912 997.8270 1010.2336 1025.9235 1041.7700 1078.6895 1091.1892 1117.3034 1155.7414 1174.4186 1191.0541 1197.1969 1198.4383 1255.6972 1258.4357 1287.6346 1322.3824 1327.2765 1357.6537 1386.9083 1399.5426 1409.8538 1436.0901 1449.9951 1458.5395 1486.0356 1487.4445 1497.2930 1520.3555 1602.9664 1617.4285 1674.9198 2995.8110 3025.3824 3029.8530 3085.3766 3092.0775 3107.9224 3115.2297 3131.5648 3135.5669 3147.5669 3168.4140 3190.2931 3536.0557
redmass: 6.2647 5.9798 5.6297 13.4676 8.4303 5.2541 6.7199 7.3252 2.6019 6.6854 2.9121 2.8008 5.0891 2.9714 3.6917 3.8476 2.8089 3.5994 4.1751 2.9634 6.1425 5.1818 2.8795 4.4022 5.3434 6.2389 5.7034 1.6244 4.5579 2.4378 4.5940 2.4957 4.9831 1.6536 1.9032 4.7615 1.2628 2.6726 5.3673 1.4307 1.3599 2.7878 3.4800 1.3073 3.1298 2.2947 3.3138 2.0776 1.5590 1.9267 3.5027 1.0511 1.1152 7.0160 2.8152 2.0784 1.1973 1.3885 1.3202 1.3760 1.2807 7.2815 1.9322 2.2520 2.3257 1.0992 1.1045 2.1777 1.0610 1.0501 2.1593 5.1473 6.0564 9.0618 1.0358 1.0631 1.0617 1.1006 1.0991 1.1019 1.0889 1.1001 1.0870 1.0934 1.0995 1.0954 1.0761
irintensity: 0.8931 0.1172 0.5523 0.0752 4.2027 0.3934 1.9901 1.8965 0.5380 1.4349 0.7186 2.6152 8.9758 0.4302 10.1702 9.3000 1.0872 2.1259 12.6631 0.6326 18.9304 8.5789 25.8781 16.2713 0.2009 5.0629 10.5979 13.5919 12.5133 1.1670 28.9783 88.2762 58.5970 110.6701 14.7023 9.0831 0.4661 2.1210 47.8727 13.8961 0.0962 32.8953 14.0433 1.9393 112.2434 30.2234 216.5190 33.9189 35.5699 2.5143 346.1387 0.5499 5.4992 51.8057 12.5540 2.8175 21.7832 1.1724 13.6515 34.4328 7.0407 45.2008 98.6361 68.1839 102.8202 31.6434 16.2176 20.6855 10.0960 4.0179 501.7998 26.3704 88.7143 269.5109 21.2370 25.2614 6.2542 1.0960 18.7470 11.1783 12.8024 1.0657 0.6977 25.9385 21.1899 5.0137 31.8381
temp: 298.150 k
press: 1.00000 atm
elementType: 35 8 8 8 8 7 7 6 6 6 6 6 6 6 6 6 6 6 1 1 1 1 1 1 1 1 1 1 1 1 1
symmnumber: 1
zpe: 609042.4 jmol-1
zpe.correction: 0.231972 hartree
zpe.thermalcorrener: 0.250056 hartree
zpe.thermalcorrenthalpy: 0.251000 hartree
zpe.thermalcorrgfe: 0.182685 hartree
zpe.sumelectzpe: -849.412433 hartree
zpe.sumelectthermal: -849.394349 hartree
zpe.sumelectthermalent: -849.393405 hartree
zpe.sumelectthermalfe: -849.461720 hartree
dipole: 4.3482 2.0764 1.3875
dipole: 5.0144
quadrupole: -121.3029 -110.8933 -117.3662
quadrupole: 0.2910 0.2075 -2.8243
quadrupole: -4.7821 5.6275 -0.8454 0.2910 0.2075 -2.8243
hfenergy: -849.6444048 hartree
pointgroup: C01 [X(C11H13Br1N2O4)]
dipole: -1.79917 0.7911555 0.170289 debye
polarizability: 227.9497458|-7.54579|129.4293709|13.6256904|31.2115676|146.9641224 unknown
InChI: InChI=1S/C11H13BrN2O4/c1-2-11(12,14(16)17)8-18-10(15)13-9-6-4-3-5-7-9/h3-7,13H,2,8H2,1H3
charge 0 multiplicity 1
31 atoms
Br 3.411766 1.72669 1.877705
O  0.776095 -0.012959 1.07014
O  5.3031 0.500506 -0.645725
O  4.619574 -1.376233 0.45232
O  -0.233857 -1.152204 -0.743728
N  4.440339 -0.181056 0.010378
N  -1.432031 0.275271 0.727021
C  3.045348 0.485601 0.29046
C  2.614067 1.329448 -0.915135
C  2.071537 -0.620563 0.745061
C  2.427214 0.511475 -2.217768
C  -0.321599 -0.374725 0.238674
C  -2.766474 0.222106 0.227878
C  -3.739644 1.007296 0.901763
C  -3.142223 -0.568014 -0.889515
C  -5.078488 1.00344 0.462401
C  -4.487884 -0.559238 -1.315534
C  -5.462063 0.219301 -0.650618
H  1.669302 1.827173 -0.632001
H  3.371086 2.115486 -1.071222
H  2.439429 -1.116468 1.653069
H  1.943563 -1.365651 -0.06244
H  3.367505 0.022706 -2.528046
H  1.635042 -0.250687 -2.125429
H  2.134633 1.202097 -3.027781
H  -1.262376 0.854371 1.553113
H  -3.448506 1.618092 1.765969
H  -2.391065 -1.170255 -1.404542
H  -5.820097 1.612868 0.990081
H  -4.773781 -1.171428 -2.17812
H  -6.502209 0.215653 -0.992131
