program: Gaussian 09
title: 000090775
version: EM64L-G09RevD.01
frameworkgroup: C1[X(C8H16O2)]
method: RPBEPBE
basis: SDD
operation: Freq
keyword: #pfreq=noraman
keyword: PBEPBE/SDD
title: #p freq=noraman PBEPBE/SDD
converged: YES YES NO NO
title: Mulliken charges:
elementType: O O C C C C C C C C H H H H H H H H H H H H H H H H
charge: -0.423038 -0.237175 -0.055402 -0.098975 -0.370846 -0.425119 -0.738005 0.130048 -0.719000 -0.708360 0.194175 0.243509 0.195715 0.209503 0.237037 0.202933 0.205146 0.242117 0.226225 0.204246 0.214627 0.243859 0.209514 0.228600 0.218858 0.369810
chargesum: 0.00000
title: Mulliken charges with hydrogens summed into heavy atoms:
elementType: O O C C C C C C C C
charge: -0.053228 -0.237175 0.138772 0.144534 0.034371 0.014851 -0.064517 0.130048 -0.056268 -0.051388
polarizability: 9.64393820e+01 1.92714690e+00 9.24436630e+01 -2.20357307e+00 -1.24854008e+00 8.69956506e+01
1716.lowfreq: -12.7280 -6.1667 -0.0006 -0.0006 -0.0001 15.9838 36.3970 72.8516 89.9389
frequency: 35.6327 72.7430 89.7366 115.7090 156.9266 170.5190 195.0578 208.0794 236.3873 256.7668 276.3563 313.4163 395.7579 427.0301 444.3331 478.2553 594.8799 626.7187 696.9740 752.7975 784.6955 805.6972 852.4436 898.9625 937.5046 966.4783 1018.0842 1026.2182 1036.3374 1054.9470 1074.2030 1095.0550 1125.9049 1153.6960 1175.2916 1232.8812 1250.9082 1257.9116 1266.3356 1297.0077 1308.5154 1338.2851 1346.9570 1380.3293 1391.0189 1396.9608 1397.9329 1462.3510 1467.3968 1476.4880 1478.6086 1480.0308 1483.9077 1485.3862 1497.0251 1654.1636 2951.9794 2971.4404 2975.7818 2976.3072 2984.6814 2988.9991 3021.2322 3027.7504 3051.2544 3066.0732 3074.1043 3075.5833 3079.0597 3085.7098 3086.8212 3495.7912
redmass: 6.0480 4.0626 2.2835 2.0548 3.2979 2.3606 1.6245 1.1715 1.3174 1.6485 1.9390 3.0433 2.8689 2.6307 2.9429 3.3697 2.1029 1.6632 2.5684 1.7726 1.7497 1.5987 1.6871 2.1141 2.1270 1.1948 1.3387 3.2213 2.1953 2.3013 1.7800 2.3040 1.9119 2.2748 2.2581 1.4719 1.3048 1.2545 1.2393 1.2971 1.2946 1.3779 1.5271 1.5537 1.2111 1.2280 1.2079 1.0723 1.0687 1.0553 1.0468 1.0552 1.0490 1.0481 1.0499 7.6959 1.0826 1.0592 1.0380 1.0364 1.0367 1.0627 1.1002 1.0851 1.0973 1.0986 1.0993 1.0989 1.1006 1.0994 1.0992 1.0637
irintensity: 1.4442 0.4643 0.0454 0.0564 0.1238 0.2157 0.6413 0.4312 0.0604 0.2314 1.7473 0.9251 1.8549 1.7614 7.3819 14.1854 51.9437 62.4197 52.7980 10.0059 0.9128 4.5943 4.0558 13.7195 12.0887 3.7743 9.6132 41.4458 188.6424 12.9393 6.1982 1.7623 14.0690 16.7070 1.9048 3.8181 3.9224 8.1180 5.4027 3.6223 9.3435 0.9186 2.6886 21.0971 11.3519 7.1778 36.8988 8.5054 0.4059 7.7592 20.1588 1.3939 15.0575 8.0654 12.0372 177.6771 16.5300 43.5608 26.7831 32.3975 26.5654 30.6091 29.7676 9.0839 2.8507 46.9094 18.0785 43.7779 71.0636 45.9997 34.9498 16.6887
temp: 298.150 k
press: 1.00000 atm
elementType: 8 8 6 6 6 6 6 6 6 6 1 1 1 1 1 1 1 1 1 1 1 1 1 1 1 1
symmnumber: 1
zpe: 597011.7 jmol-1
zpe.correction: 0.227390 hartree
zpe.thermalcorrener: 0.239934 hartree
zpe.thermalcorrenthalpy: 0.240878 hartree
zpe.thermalcorrgfe: 0.188776 hartree
zpe.sumelectzpe: -464.079891 hartree
zpe.sumelectthermal: -464.067347 hartree
zpe.sumelectthermalent: -464.066403 hartree
zpe.sumelectthermalfe: -464.118505 hartree
dipole: 0.8032 -0.0493 -1.2893
dipole: 1.5198
quadrupole: -63.5267 -58.0167 -67.3643
quadrupole: -0.1129 3.4904 2.9527
quadrupole: -0.5574 4.9525 -4.3951 -0.1129 3.4904 2.9527
hfenergy: -464.3072809 hartree
pointgroup: C01 [X(C8H16O2)]
dipole: -0.3289473 0.069977 -0.4944051 debye
dipolederiv: -0.4490006 -0.1843338 -0.0571356 -0.2342128 -1.0080448 -0.3736002 -0.0363267 -0.2971253 -0.3801052 -0.4747892 -0.0861666 -0.2261641 0.0403712 -0.5932607 0.1263707 -0.2994495 -0.1006749 -0.7877635 0.239679 -0.1248445 0.0326248 -0.1016035 0.1738521 0.0064219 -0.0729504 0.0652107 0.0895704 -0.1433206 0.0735052 -0.0191189 0.0696651 -0.2168211 0.0624923 0.0134217 0.0351408 0.0153871 0.0639999 -0.0429143 0.0205828 -0.0083678 0.0955808 -0.0393143 0.0211913 -0.0460477 0.0653068 0.0806548 0.0541298 -0.0329229 0.042529 0.1259423 -0.0495952 -0.0131289 0.0042514 0.0950399 -0.0137454 -0.0015311 -0.0220784 -0.0026764 0.011494 -0.0867565 -0.0092266 -0.0686371 -0.0626197 0.4131665 0.2054449 0.4250477 0.122458 1.3768115 0.0842181 0.502784 0.1430748 0.9256252 0.0173282 -0.0342454 -0.0429807 -0.0415802 0.0289049 -0.0807342 -0.0269897 -0.0715732 -0.0268041 -0.0394546 0.0169907 0.062623 0.0045524 0.0417294 -0.0070745 0.0580664 -0.0183814 0.0669501 0.0078654 0.0410677 -0.0291141 0.0343382 -0.0910259 0.1046822 0.0032974 0.1041374 -0.0904607 0.0902867 -0.0030803 -0.0082865 -0.0021882 0.0045107 -0.0662574 -0.0308981 -0.053033 -0.0943205 -0.127543 0.0874317 0.0689766 0.112578 -0.018331 -0.074435 0.0659788 -0.0676604 0.0139669 0.0648883 0.0217292 -0.0554631 -0.0210728 -0.0556308 0.1060665 -0.0385247 0.1074864 -0.0839935 0.0416876 -0.0236514 -0.0141726 -0.0115309 0.0642086 -0.042055 -0.034863 -0.0860458 -0.0974558 0.0075948 0.0770983 -0.0173579 0.0606427 -0.1251337 0.0811688 -0.0154231 0.0903439 0.0371417 -0.1161253 0.1356642 0.0942418 0.0996246 0.0277044 -0.0446298 0.0552039 -0.0367747 0.056393 0.0993615 0.0040296 -0.0417653 0.0133491 -0.0127134 0.1273904 -0.0267789 0.0690734 -0.0062135 -0.0479806 -0.1584933 -0.039782 -0.1390242 -0.0245537 -0.0142955 -0.0226051 0.005516 0.0652767 0.097876 -0.0098505 0.007472 0.0223788 -0.0623252 0.1533708 -0.023482 0.0934582 -0.0623017 -0.1562927 -0.1289086 -0.0419719 -0.12727 0.031955 -0.022126 0.0007223 -0.0090902 0.0704708 0.00815 0.1167354 0.0774124 0.1005624 0.0008661 -0.0497428 0.0537809 -0.0399613 0.0513425 0.0501892 -0.0134252 -0.0952015 0.0113615 0.0686622 -0.0697027 -0.0208222 -0.0618147 -0.1413386 0.0703016 0.0552189 -0.013771 0.0953993 -0.0889548 0.068649 -0.0424604 0.0953636 0.0275249 -0.119447 -0.1198342 0.0503144 -0.1496614 -0.0111166 0.0176798 0.036189 -0.0003002 0.0843287 0.3346696 0.0422337 -0.0820092 0.0093779 0.2556898 0.0818086 -0.0967065 0.1440634 0.169052 unknown
polarizability: 96.4095548|1.835182|92.1816501|2.1683992|1.9210434|87.2874907 unknown
InChI: InChI=1S/C8H16O2/c1-4-6(3)7(5-2)8(9)10/h6-7,9H,4-5H2,1-3H3
charge 0 multiplicity 1
26 atoms
O  0.191255 -2.190432 -0.092649
O  1.177843 -0.96045 1.603409
C  -0.993663 0.960455 0.088603
C  0.304809 0.21558 -0.405588
C  -2.258727 0.057382 0.060239
C  1.53785 1.155705 -0.484963
C  -0.822975 1.614257 1.480426
C  0.617664 -0.977956 0.483295
C  -2.612067 -0.525734 -1.325706
C  2.721194 0.536442 -1.259125
H  -1.150303 1.770674 -0.656792
H  0.095662 -0.179434 -1.416465
H  -3.108909 0.668819 0.424426
H  -2.13971 -0.768469 0.790552
H  1.865055 1.416152 0.53799
H  1.220605 2.096354 -0.977353
H  -1.754382 2.135564 1.769619
H  -0.597015 0.859717 2.255013
H  -0.006773 2.357494 1.490414
H  -2.665301 0.272868 -2.090834
H  -3.595573 -1.029894 -1.299126
H  -1.867169 -1.27168 -1.653101
H  2.43173 0.270786 -2.29332
H  3.087566 -0.380928 -0.762186
H  3.568517 1.24374 -1.315574
H  0.404316 -2.936614 0.533196
