program: Gaussian 09
title: 000090827
version: EM64L-G09RevD.01
frameworkgroup: C1[X(C26H29ClN2O2)]
method: RPBEPBE
basis: SDD
operation: Freq
keyword: #p
keyword: freq=noraman
keyword: PBEPBE/SDD
title: #p freq=noraman PBEPBE/SDD
converged: YES YES NO NO
title: Mulliken charges:
elementType: Cl O O N N C C C C C C C C C C C C C C C C C C C C C C C C C C H H H H H H H H H H H H H H H H H H H H H H H H H H H H H
charge: -0.066554 -0.295392 -0.270786 -0.086325 -0.174672 -0.381905 -0.358510 -0.401453 -0.387103 -0.364506 0.468703 -0.254015 -0.268229 -0.349803 -0.388181 0.379432 0.479914 -0.377202 -0.359481 0.318241 -0.376366 -0.414126 -0.448083 -0.352326 -0.213970 -0.200854 -0.224773 -0.226673 -0.114464 -0.240840 -0.537470 0.211967 0.186219 0.191972 0.199753 0.216816 0.204931 0.213425 0.203961 0.219418 0.195524 0.186638 0.224089 0.205543 0.239755 0.217085 0.243743 0.234706 0.250740 0.284160 0.233932 0.254845 0.253936 0.253016 0.228251 0.228360 0.230583 0.241533 0.216034 0.216838
chargesum: 0.00000
title: Mulliken charges with hydrogens summed into heavy atoms:
elementType: Cl O O N N C C C C C C C C C C C C C C C C C C C C C C C C C C
charge: -0.066554 -0.295392 -0.270786 -0.086325 -0.174672 0.016281 0.033216 0.020294 0.030282 0.050436 0.468703 0.156712 -0.062686 -0.110049 -0.171096 0.379432 0.479914 -0.133459 -0.124776 0.318241 -0.125626 -0.129966 -0.214151 -0.097481 0.039966 0.052163 0.003478 0.001687 -0.114464 -0.010258 0.136935
polarizability: 4.29851725e+02 -2.17388166e+01 2.88654205e+02 1.91110604e+01 2.50242507e+00 2.36094434e+02
1716.lowfreq: -4.7355 -2.2892 0.0017 0.0023 0.0024 4.3171 10.6076 15.5256 17.0809
frequency: 9.8152 15.4671 16.6485 26.1985 32.3277 35.8041 44.6297 50.4531 54.9808 66.1807 86.2373 99.9244 113.7417 127.0027 139.8920 168.5958 182.8707 195.9497 208.6760 238.0780 244.9879 249.1374 250.5626 272.8941 291.6971 295.2992 321.7017 332.5982 366.8139 378.8039 398.5582 402.7798 409.5597 412.2237 421.3277 442.5794 453.4949 476.7464 481.0727 489.5650 523.0474 529.0865 559.8943 603.1415 614.9906 623.8743 626.6691 634.9814 673.7959 679.4089 705.7736 714.3035 716.4011 767.0911 772.7670 778.7346 791.5137 796.2476 809.5227 815.1056 835.0571 847.6662 849.3894 856.8538 868.6048 911.6893 919.2311 927.2898 937.5912 940.8412 951.5664 962.3068 979.4942 983.7707 986.5902 990.6650 998.8590 999.6870 999.8460 1009.3371 1023.0734 1029.4075 1047.8815 1063.7373 1072.4497 1077.9142 1080.6175 1086.3607 1102.5907 1107.9841 1113.0088 1120.3145 1144.1265 1151.5365 1158.9278 1172.9541 1173.7541 1178.4160 1184.1931 1184.3951 1187.8535 1201.7338 1210.5791 1226.3959 1230.8131 1237.8005 1263.5331 1269.8838 1280.9649 1289.1223 1296.1160 1300.9865 1311.7340 1328.8884 1336.5087 1342.3405 1350.3128 1352.1417 1371.8517 1372.9662 1375.7432 1381.8310 1386.4077 1389.8556 1402.0652 1427.5127 1437.9727 1442.6199 1453.8850 1457.6993 1460.7139 1465.7102 1467.5048 1474.8437 1475.0830 1475.8839 1481.1046 1487.7829 1508.4607 1575.3825 1586.1819 1594.6493 1601.1240 1611.4475 1632.6057 2855.3482 2862.3105 2892.2895 2897.3326 2898.5042 2911.2194 2936.7322 2949.7532 3019.2227 3033.3238 3035.3673 3041.3081 3049.0946 3049.3904 3080.9433 3111.4084 3118.3367 3126.2147 3135.7403 3136.4620 3137.5278 3148.8997 3149.2323 3159.9033 3160.7020 3164.4448 3169.3671 3171.9001 3183.7731
redmass: 6.4252 5.2990 3.3533 3.9573 4.3825 5.8721 4.0399 5.0353 3.9481 4.7015 3.1768 3.6855 3.0771 5.0386 5.5764 4.7607 4.5300 4.0314 3.0468 5.2904 1.7658 3.7594 1.7797 3.3595 2.6256 4.3412 3.7979 4.5139 3.0970 5.1068 2.9834 2.8252 2.9391 3.2071 3.5970 4.4599 4.0237 3.2939 3.1286 3.8015 3.4031 2.7926 4.5220 3.1913 6.2295 5.2652 6.0674 6.3511 4.6949 2.9803 1.7310 4.1393 3.6417 2.3950 3.5617 2.9949 2.0185 1.3952 1.3560 1.5676 1.3372 2.3742 1.5552 1.2489 2.6502 1.8159 2.3153 1.8692 1.4109 2.9791 2.0992 1.4361 1.3912 1.3541 4.9282 6.2387 1.3491 4.2897 3.1877 2.6416 2.9958 3.9529 1.8300 2.1049 2.6798 1.8710 1.7632 2.5145 2.2210 1.3456 1.2605 1.4123 2.4575 2.4557 1.3534 1.2478 1.4398 1.4538 1.3301 1.3492 1.4231 1.1213 1.8601 1.8045 2.4137 1.6503 1.2276 1.6955 1.2561 1.3099 1.3051 1.3872 1.3157 1.3934 1.3056 1.3720 1.8514 1.6460 3.8949 2.2824 1.8528 1.6545 5.0828 3.6399 1.4778 3.1957 1.2225 2.1224 1.0795 1.0867 1.0964 1.0507 1.1070 1.3743 1.0805 1.6518 2.2716 1.0881 2.4165 7.0057 7.8310 6.1165 6.2481 6.0688 6.4493 1.0711 1.0697 1.0697 1.0691 1.0817 1.0706 1.0626 1.0334 1.0944 1.1035 1.0894 1.0898 1.0922 1.0916 1.0891 1.0882 1.0986 1.0858 1.0894 1.0867 1.0909 1.0960 1.0872 1.0896 1.0948 1.1014 1.0956 1.0956 1.0955
irintensity: 0.1747 0.0207 0.5469 0.0210 0.0130 0.1285 1.6200 0.2335 1.1937 1.4291 1.9047 1.4255 1.9908 1.9509 0.9478 2.3229 4.6005 6.5779 8.1547 0.6328 0.1819 2.9540 0.6471 1.0574 8.6597 2.4557 2.6640 0.6443 6.1678 0.1415 4.2698 1.7121 0.4186 4.0553 3.1482 12.9584 3.8409 13.7707 3.4742 15.9685 9.1736 17.5109 11.0066 4.7809 1.7336 11.1366 4.2963 0.5186 11.5264 31.0654 64.0640 6.5441 1.9387 32.8502 42.9764 5.9871 49.7094 7.1648 12.0577 64.4941 0.6868 10.2566 3.0949 0.2683 19.2205 21.2000 29.1381 1.9333 1.4783 11.7232 0.6945 1.7299 0.0261 0.5007 19.7381 1.3430 14.3184 97.5801 97.3841 17.7864 78.7916 150.9651 5.5806 2.2348 28.9021 6.1579 5.8015 24.4219 3.9933 9.7140 0.2473 6.5295 90.4112 14.2626 1.4714 5.6728 7.8739 10.8415 42.7587 34.2746 2.4533 5.2662 3.8748 117.9204 182.2951 57.4423 15.1520 11.3311 22.2419 25.6393 20.4740 17.3202 0.6472 10.8371 0.1543 4.4696 8.3729 0.6452 4.7419 13.6671 1.4607 32.3952 0.8684 7.8983 1.3788 5.6939 19.7824 12.4447 0.8390 2.3300 46.5249 13.3933 50.2080 92.8015 41.9008 34.9867 13.0703 7.9822 349.1908 0.4640 4.3967 0.4774 5.5349 1.0059 6.9947 52.2040 69.3578 71.9594 85.1355 37.8554 114.5012 57.6445 82.7612 22.8971 56.2361 24.2692 53.4862 18.8909 60.7724 21.9793 9.0078 33.3680 0.1093 6.7896 20.8598 12.4668 30.9802 13.9103 1.8683 21.6424 23.8617 4.5983 6.6729 2.5937
temp: 298.150 k
press: 1.00000 atm
elementType: 17 8 8 7 7 6 6 6 6 6 6 6 6 6 6 6 6 6 6 6 6 6 6 6 6 6 6 6 6 6 6 1 1 1 1 1 1 1 1 1 1 1 1 1 1 1 1 1 1 1 1 1 1 1 1 1 1 1 1 1
symmnumber: 1
zpe: 1288825.8 jmol-1
zpe.correction: 0.490888 hartree
zpe.thermalcorrener: 0.520027 hartree
zpe.thermalcorrenthalpy: 0.520971 hartree
zpe.thermalcorrgfe: 0.425135 hartree
zpe.sumelectzpe: -1725.858099 hartree
zpe.sumelectthermal: -1725.828960 hartree
zpe.sumelectthermalent: -1725.828016 hartree
zpe.sumelectthermalfe: -1725.923851 hartree
dipole: -1.4590 1.4423 -1.9101
dipole: 2.8031
quadrupole: -220.8846 -184.6337 -177.8359
quadrupole: 25.7447 10.9988 3.1350
quadrupole: -26.4332 9.8177 16.6155 25.7447 10.9988 3.1350
hfenergy: -1726.3489865 hartree
pointgroup: C01 [X(C26H29Cl1N2O2)]
dipole: 0.5494501 0.5633927 0.7725846 debye
polarizability: 428.1927894|24.2123208|289.6636666|22.8856066|-0.6006173|236.7439083 unknown
InChI: InChI=1S/C26H29ClN2O2/c1-30-25-13-11-24(12-14-25)29-17-15-28(16-18-29)19-20-31-26(21-5-3-2-4-6-21)22-7-9-23(27)10-8-22/h2-14,26H,15-20H2,1H3
charge 0 multiplicity 1
60 atoms
Cl -8.773495 -3.226558 -0.332961
O  -2.582965 -0.472072 -0.295053
O  9.658653 -0.075956 0.350645
N  1.135691 -0.289776 -0.637324
N  4.013695 -0.486239 -0.339587
C  2.021593 -0.392232 -1.820779
C  1.734748 -1.040043 0.492969
C  3.416963 0.180849 -1.512654
C  3.117094 -0.466002 0.841404
C  -0.266094 -0.681002 -0.92009
C  5.419654 -0.368042 -0.131243
C  -1.240583 0.034478 0.026948
C  -3.642883 0.088878 0.566943
C  6.242459 0.446341 -0.968648
C  6.068417 -1.099103 0.903988
C  -4.913773 -0.723333 0.301142
C  -3.817992 1.592032 0.341487
C  7.635968 0.510098 -0.785273
C  7.463182 -1.025876 1.103146
C  8.258853 -0.220314 0.252265
C  -6.159684 -0.266169 0.799557
C  -4.862817 -1.955716 -0.39326
C  -3.567239 2.511794 1.387012
C  -4.210723 2.081734 -0.930478
C  -7.337788 -1.021875 0.614977
C  -6.034198 -2.721743 -0.593377
C  -3.715267 3.902623 1.174185
C  -4.353267 3.468039 -1.148116
C  -7.253957 -2.242586 -0.082088
C  -4.108723 4.383255 -0.094869
C  10.329767 -0.820318 1.414241
H  1.575962 0.184864 -2.651749
H  2.136996 -1.454181 -2.157021
H  1.841323 -2.12698 0.243973
H  1.079349 -0.955166 1.378394
H  4.061927 0.006568 -2.391898
H  3.32905 1.282717 -1.357219
H  2.987605 0.577086 1.213558
H  3.55756 -1.062817 1.655584
H  -0.516803 -0.385869 -1.955211
H  -0.425787 -1.784106 -0.847127
H  -1.007321 -0.183421 1.092759
H  -1.181961 1.129405 -0.1265
H  -3.342827 -0.064636 1.631281
H  5.798382 1.054205 -1.761795
H  5.487271 -1.76167 1.553661
H  8.257931 1.137195 -1.431955
H  7.912586 -1.611562 1.911323
H  -6.218745 0.692413 1.327193
H  -3.902737 -2.303803 -0.781726
H  -3.254671 2.140485 2.371764
H  -4.399675 1.369447 -1.741724
H  -8.298011 -0.666624 0.999861
H  -5.995438 -3.671642 -1.134657
H  -3.520721 4.605745 1.991724
H  -4.656766 3.838176 -2.133916
H  -4.222757 5.459861 -0.264227
H  11.395691 -0.564592 1.319306
H  9.962729 -0.517647 2.415485
H  10.197871 -1.913912 1.29055
