program: Gaussian 09
title: 000090767
version: EM64L-G09RevD.01
frameworkgroup: C1[X(C11H12N2)]
method: RPBEPBE
basis: SDD
operation: Freq
keyword: #pfreq=noraman
keyword: PBEPBE/SDD
title: #p freq=noraman PBEPBE/SDD
converged: YES YES NO NO
title: Mulliken charges:
elementType: N N C C C C C C C C C C C H H H H H H H H H H H H
charge: -0.060415 -0.030816 -0.170487 -0.223572 -0.679696 -0.680062 0.271090 0.046492 -0.285102 -0.186417 -0.172257 -0.369794 -0.304143 0.245284 0.292631 0.221487 0.231109 0.211526 0.211400 0.230992 0.221531 0.259313 0.242242 0.234341 0.243322
chargesum: 0.00000
title: Mulliken charges with hydrogens summed into heavy atoms:
elementType: N N C C C C C C C C C C C
charge: -0.060415 -0.030816 0.074797 0.069059 -0.015575 -0.016138 0.271090 0.046492 -0.025788 0.055825 0.062084 -0.126471 -0.304143
polarizability: 1.91060738e+02 -2.42379728e+00 1.40997304e+02 1.25096021e-02 -5.27500606e-02 7.19693708e+01
1716.lowfreq: -2.0043 -0.0006 -0.0003 0.0009 8.6062 9.8578 34.3870 53.0843 74.9881
frequency: 34.2887 53.0687 74.9785 99.7040 126.4148 150.6576 211.0597 239.1602 258.6302 291.6330 315.0051 392.3965 403.2271 412.0503 435.4437 479.6589 508.4200 614.9257 651.0919 672.7417 746.8961 754.0177 795.9339 836.8282 904.1267 922.6113 940.7378 949.0854 960.9398 961.8472 967.6069 997.9199 1003.8973 1045.6608 1092.0930 1093.2925 1152.5698 1170.2180 1194.2148 1249.7551 1280.7290 1302.1885 1315.8391 1328.8893 1342.9250 1374.1730 1391.8434 1411.9113 1454.0960 1464.8186 1468.2539 1477.5793 1487.5263 1558.8888 1578.9851 1616.8270 2166.0396 2976.8240 2978.7922 3001.5281 3072.1666 3079.2193 3084.4549 3088.1050 3106.6978 3128.7605 3142.5975 3158.5736 3174.7387
redmass: 3.0040 4.8824 3.3957 4.0065 9.0898 4.3390 1.0294 1.0858 3.4551 6.1733 3.6250 2.9929 3.2871 3.2142 3.4123 6.8652 3.2810 7.5010 4.8651 7.1418 1.8545 4.8622 2.1263 2.5654 1.3034 1.1833 2.3401 1.2761 1.4934 5.0977 1.5579 2.8713 1.3406 2.2064 1.6053 2.5931 1.9660 1.0851 2.0672 2.1798 1.5320 1.3075 3.3588 2.5831 1.6079 1.1845 1.2169 1.9231 2.3319 1.0495 1.0449 1.0497 1.0590 5.4185 5.7025 7.8928 12.6322 1.0347 1.0351 1.0847 1.1004 1.0995 1.1008 1.1000 1.0888 1.0889 1.0889 1.0944 1.1015
irintensity: 0.2201 5.6785 0.0094 2.0155 5.4018 0.2219 0.0014 0.2115 0.1917 0.5265 1.6689 0.2881 3.9029 0.1760 1.5368 0.8334 5.1829 2.3370 2.8729 7.2885 29.8789 1.9118 53.6676 1.8375 1.3034 3.3856 45.2785 4.8255 3.9339 12.1758 1.9243 5.5087 0.2261 4.7479 1.5182 3.9890 2.8647 2.3787 9.1247 5.3109 0.8194 0.2089 0.6122 4.3860 18.5596 14.0857 2.8279 29.3942 53.0103 8.0831 0.2373 11.3917 15.9433 8.3845 74.1984 35.1092 21.0784 27.0366 41.0208 5.8088 0.7294 70.9496 23.5212 37.6454 0.8241 16.6350 7.0795 14.4637 20.3535
temp: 298.150 k
press: 1.00000 atm
elementType: 7 7 6 6 6 6 6 6 6 6 6 6 6 1 1 1 1 1 1 1 1 1 1 1 1
symmnumber: 1
zpe: 527426.2 jmol-1
zpe.correction: 0.200886 hartree
zpe.thermalcorrener: 0.213676 hartree
zpe.thermalcorrenthalpy: 0.214620 hartree
zpe.thermalcorrgfe: 0.160743 hartree
zpe.sumelectzpe: -534.908153 hartree
zpe.sumelectthermal: -534.895363 hartree
zpe.sumelectthermalent: -534.894419 hartree
zpe.sumelectthermalfe: -534.948296 hartree
dipole: -1.4623 -2.7620 -0.0013
dipole: 3.1252
quadrupole: -58.0944 -86.7681 -79.6814
quadrupole: -4.8550 0.0069 0.0014
quadrupole: 16.7536 -11.9202 -4.8334 -4.8550 0.0069 0.0014
hfenergy: -535.1090393 hartree
pointgroup: C01 [X(C11H12N2)]
dipole: -0.620014 -1.0617496 -0.007339 debye
dipolederiv: -0.5433759 -0.1012528 0.0003575 -0.2196941 -0.3812144 -0.0003769 -0.0000387 -0.000493 -0.2194569 -0.249111 -0.0298314 -0.0002448 -0.0066106 -0.4024735 -0.0012881 0.000007 -0.0011978 -0.2460757 -0.0623179 0.0357152 -0.0004455 0.2277917 0.0222757 -0.0014085 -0.0043533 0.0013288 0.0592846 0.4419403 -0.2915671 -0.0029362 -0.237716 0.0901758 0.002909 -0.0008533 0.001856 -0.1554926 -0.0844926 0.0763855 -0.0401561 -0.0983681 0.1274555 0.010214 0.1130352 -0.0162163 -0.0019742 -0.0827754 0.0753862 0.0416228 -0.0968397 0.1269727 -0.0086632 -0.1103393 0.0155321 -0.0009725 -0.2361949 0.1197446 0.0015946 0.3406145 -0.1097748 -0.0020807 0.0044543 -0.0018459 0.047405 0.9567202 0.2009143 -0.00154 0.0314635 0.0383452 -0.0007544 -0.0032374 -0.001205 0.0813 -0.5362998 -0.0178116 0.0013752 0.1790439 0.028414 0.0005301 0.0025927 0.0012079 -0.1116782 0.3022911 -0.0557357 -0.0017832 -0.0063956 0.1598999 0.0017627 -0.0013873 0.001857 -0.1191781 -0.0244412 0.1218099 0.0006392 -0.1477247 -0.2435939 -0.0001592 -0.0008192 -0.0010328 -0.1235787 0.083143 -0.0318211 -0.0006161 0.2351739 0.3980254 0.0021503 0.0008064 0.0030803 -0.0670953 -0.0993903 0.0195827 0.0006771 -0.007454 0.3704379 0.0028005 0.0000593 0.0030509 0.020929 0.023487 0.0037737 0.0001851 -0.0512676 -0.1190543 -0.0001765 0.0004985 -0.0008741 0.0315828 0.1302171 0.0171181 -0.0001418 -0.0599619 0.0044315 -0.0008335 -0.0009351 -0.0010888 0.1164356 -0.2230908 0.0097604 -0.0312084 0.0006387 0.0721286 0.0216392 -0.0440737 0.0409511 0.0757231 0.0917496 0.0343331 0.0869909 0.0317416 0.0450416 -0.0862571 0.0524236 -0.0580641 -0.1070127 0.0974324 -0.0799659 -0.0082647 -0.0236636 -0.1446847 0.0369164 -0.0080436 -0.0315762 0.0716338 0.0972975 -0.0797492 0.0076041 -0.0237469 -0.144967 -0.0378394 0.0080216 0.0308177 0.0715691 0.0911307 0.0350179 -0.0879952 0.032524 0.0444421 0.0867932 -0.0529687 0.0588243 -0.1060732 -0.2222661 0.0090417 0.0331068 -0.000131 0.0725202 -0.0218315 0.044282 -0.0405914 0.0748245 0.1163245 -0.0464094 -0.000183 -0.05495 -0.0361976 -0.0011835 -0.0001785 -0.0012679 0.1611659 -0.0173856 0.0868436 0.0010716 0.1093143 0.0049409 -0.0012916 0.0012124 -0.0011978 0.1486627 -0.0971926 -0.0657789 0.0003178 -0.0584846 0.0819956 -0.0003881 0.0002564 -0.0003597 0.1677534 0.0466007 -0.0455037 -0.0000279 -0.0952976 -0.1055424 -0.0011831 -0.0004212 -0.0014954 0.1303187 unknown
polarizability: 190.7713053|-4.4933432|141.2812644|-0.4230037|0.5423783|71.974843 unknown
InChI: InChI=1S/C11H12N2/c1-9(2)7-10(8-12)11-5-3-4-6-13-11/h3-7,9H,1-2H3
charge 0 multiplicity 1
25 atoms
N  -1.319793 -1.312547 -0.104208
N  1.114379 2.911609 -0.080842
C  2.927504 -0.411476 -0.115331
C  1.434536 -0.620195 -0.112076
C  3.550123 -1.047481 1.160193
C  3.545115 -1.040628 -1.396229
C  0.464464 0.352599 -0.099501
C  -0.993779 0.021728 -0.096895
C  -1.986319 1.037328 -0.086655
C  -3.347932 0.666584 -0.084783
C  -3.687439 -0.70464 -0.092754
C  -2.635588 -1.652329 -0.101852
C  0.828868 1.749052 -0.089142
H  3.153142 0.672403 -0.112484
H  1.067162 -1.6571 -0.119851
H  4.646528 -0.907003 1.156031
H  3.145089 -0.585992 2.077942
H  3.344307 -2.133637 1.199908
H  3.340011 -2.126767 -1.440395
H  3.135866 -0.575197 -2.310149
H  4.641425 -0.899402 -1.396414
H  -1.692702 2.091805 -0.080143
H  -4.127843 1.435073 -0.077354
H  -4.730193 -1.035921 -0.092178
H  -2.851131 -2.727167 -0.108139
