program: Gaussian 09
title: 000090863
version: EM64L-G09RevD.01
frameworkgroup: C1[X(C18H26N2O2)]
method: RPBEPBE
basis: SDD
operation: Freq
keyword: #p
keyword: freq=noraman
keyword: PBEPBE/SDD
title: #p freq=noraman PBEPBE/SDD
converged: YES YES NO NO
title: Mulliken charges:
elementType: O O N N C C C C C C C C C C C C C C C C C C H H H H H H H H H H H H H H H H H H H H H H H H H H
charge: -0.268579 -0.299499 -0.223259 -0.122045 -0.089765 -0.440825 -0.484914 -0.553333 0.317336 0.244046 -0.003532 0.190836 -0.583207 -0.342343 0.457936 0.256497 -0.384003 -0.692331 -0.699311 -0.816695 -0.813127 -0.809605 0.242528 0.226696 0.226559 0.271367 0.238603 0.221299 0.240443 0.185863 0.235314 0.293610 0.232169 0.208840 0.274466 0.204477 0.209698 0.209473 0.271970 0.240524 0.227945 0.274965 0.269381 0.238841 0.230585 0.227532 0.234146 0.222426
chargesum: 0.00000
title: Mulliken charges with hydrogens summed into heavy atoms:
elementType: O O N N C C C C C C C C C C C C C C C C C C
charge: -0.268579 -0.299499 -0.223259 -0.122045 0.152763 0.012430 0.025056 -0.091591 0.317336 0.244046 0.182332 0.190836 -0.347893 -0.048733 0.457936 0.256497 -0.151835 -0.004548 -0.008169 -0.073260 -0.129022 -0.070799
polarizability: 2.64754096e+02 -1.96433058e+01 2.28718853e+02 -2.06071469e+01 -1.15431053e+01 1.55733944e+02
1716.lowfreq: -17.9136 -5.1386 0.0003 0.0004 0.0005 5.4700 18.7825 23.7755 40.3782
frequency: 17.4460 23.0081 40.2048 46.0946 60.7376 64.6214 86.1340 105.1806 110.6956 130.7656 140.1991 156.8068 190.5055 201.5367 210.3029 215.5734 221.3975 234.5089 243.4246 266.7237 285.3396 317.9430 340.6570 348.4252 364.5180 377.5900 417.7017 433.3359 441.6154 446.3182 463.8084 471.6859 498.3001 539.6621 553.3722 575.1863 583.7846 591.5488 624.6657 654.8561 664.7660 712.7184 723.7931 728.8525 813.1966 823.1401 842.3617 862.6239 878.7941 896.2506 919.0184 922.8009 936.7124 942.9185 958.4800 964.2403 986.0460 1002.2082 1006.0608 1020.9559 1024.7398 1025.5003 1046.3506 1065.3579 1088.9855 1122.4829 1130.5725 1139.8612 1143.0532 1156.4269 1181.9712 1186.3123 1206.1426 1211.2706 1226.8795 1231.3272 1260.2012 1283.4113 1290.4023 1310.0389 1318.3941 1330.3638 1340.0540 1342.5586 1362.2198 1369.4027 1370.7419 1372.4821 1379.8458 1385.9933 1390.9032 1397.8811 1416.8938 1427.4924 1445.8408 1452.9252 1454.4048 1457.9525 1466.0670 1466.7951 1470.0136 1470.1543 1477.7397 1479.8897 1484.3520 1486.6510 1498.7085 1501.5242 1579.7926 1586.8912 1592.8608 1626.4108 2964.4480 2975.0567 2976.9144 2982.2254 2983.0155 2984.5454 2990.7244 2992.5672 2998.9289 3026.1958 3053.2409 3061.2939 3069.0053 3071.3089 3077.6893 3077.9528 3081.8929 3085.0113 3103.9478 3104.2878 3112.9459 3118.2644 3125.4215 3127.2107 3128.2393 3208.9074
redmass: 3.5833 4.3966 1.1588 3.0694 3.4663 4.2318 3.7993 3.6273 3.0766 1.5523 2.6172 2.0605 3.8665 1.8821 1.6865 1.9738 1.1319 2.1957 1.1369 3.1618 3.5639 2.7632 3.5478 2.4462 3.2560 4.9250 3.5126 3.4261 2.8649 2.9491 3.3811 3.2279 4.0387 3.1247 4.1148 3.7829 3.4484 3.4037 3.5657 2.6475 3.8163 4.1512 3.4940 3.5461 2.4334 1.4602 2.4498 2.8144 1.6702 2.2570 1.2010 2.3045 2.5947 1.4816 1.3873 1.8101 1.8230 1.6445 1.9582 1.7606 1.6681 1.6984 1.5432 2.5204 2.2211 2.2119 2.8192 1.8734 2.3671 2.2227 1.3752 1.5084 2.9850 1.9288 1.9344 1.4236 3.5127 1.8727 1.4349 1.4674 1.3990 1.6461 1.5910 1.4944 1.4822 1.3707 1.2639 1.2361 2.5160 1.2223 1.7015 1.2619 3.0851 1.9491 1.0858 1.0731 1.0688 1.0895 1.1042 1.0920 1.0490 1.0538 1.1786 1.0528 1.0584 1.1121 2.2673 1.0684 6.4129 5.4905 7.2295 6.4147 1.0711 1.0375 1.0625 1.0522 1.0406 1.0433 1.0385 1.0577 1.0646 1.0935 1.0971 1.1021 1.0986 1.0997 1.0986 1.0981 1.0990 1.0840 1.0905 1.0904 1.0991 1.0988 1.0970 1.0912 1.0978 1.0933
irintensity: 0.3595 0.7981 0.0673 4.6488 0.6127 3.6706 2.0061 1.8718 2.1572 1.3049 0.0953 2.0562 1.4130 3.6972 2.7423 3.3700 0.7167 2.1993 0.0959 1.9624 0.3078 4.0560 2.0770 0.9320 1.6478 0.6471 2.2827 0.4117 6.8623 7.3187 1.8228 4.9014 2.5423 2.8875 7.2487 9.3827 19.9497 5.9486 5.8305 5.1223 4.1436 1.0094 1.6398 0.2069 2.7148 37.8529 7.4705 3.1563 2.9807 11.0411 4.7515 1.7065 7.5889 0.4093 1.2718 1.8798 11.5142 23.4574 5.6548 7.6862 1.0830 11.9809 12.8076 2.8396 9.0995 30.3055 25.5179 5.1052 7.7132 4.3220 25.9986 18.9478 16.4737 40.0098 124.5900 21.5675 4.7649 179.1927 7.2930 9.1009 12.1438 7.2420 65.6644 39.8089 38.5630 11.4033 25.8547 33.4150 13.5709 56.8374 47.1211 16.6362 0.7543 58.4774 51.3459 21.7237 20.5151 1.7386 11.1164 27.2930 10.6990 20.7886 25.5458 22.7802 5.5866 9.8738 102.9140 24.5861 166.4160 230.9555 75.0305 4.2748 25.1192 44.5951 28.6978 12.5913 26.2134 39.9171 8.8465 37.3165 19.8863 24.4204 20.4249 40.1140 15.8476 25.3415 48.9106 26.4491 17.2347 4.9843 34.1291 10.3927 1.8595 16.1353 9.9366 19.7465 9.7813 1.6288
temp: 298.150 k
press: 1.00000 atm
elementType: 8 8 7 7 6 6 6 6 6 6 6 6 6 6 6 6 6 6 6 6 6 6 1 1 1 1 1 1 1 1 1 1 1 1 1 1 1 1 1 1 1 1 1 1 1 1 1 1
symmnumber: 1
zpe: 1068976.1 jmol-1
zpe.correction: 0.407151 hartree
zpe.thermalcorrener: 0.430598 hartree
zpe.thermalcorrenthalpy: 0.431542 hartree
zpe.thermalcorrgfe: 0.353080 hartree
zpe.sumelectzpe: -959.821464 hartree
zpe.sumelectthermal: -959.798018 hartree
zpe.sumelectthermalent: -959.797074 hartree
zpe.sumelectthermalfe: -959.875535 hartree
dipole: 0.2768 -0.6204 0.5218
dipole: 0.8566
quadrupole: -147.9045 -141.2780 -129.2319
quadrupole: -28.1759 -1.1429 0.4451
quadrupole: -8.4330 -1.8066 10.2396 -28.1759 -1.1429 0.4451
hfenergy: -960.2286156 hartree
pointgroup: C01 [X(C18H26N2O2)]
dipole: -0.0985359 0.2656545 0.1824575 debye
polarizability: 262.7559268|-19.2704108|231.8237261|23.2632154|3.8774046|154.62724 unknown
InChI: InChI=1S/C18H26N2O2/c1-12(2)19(14(4)21)11-17-8-7-16-10-13(3)6-9-18(16)20(17)15(5)22/h6,9-10,12,17H,7-8,11H2,1-5H3
charge 0 multiplicity 1
48 atoms
O  -1.908039 -3.340176 -0.06224
O  4.266736 2.060029 -0.363636
N  -0.700852 -1.347254 0.266859
N  2.622296 0.41133 -0.403884
C  0.589675 -0.700318 0.648961
C  0.360499 0.247018 1.845852
C  1.230228 -0.035263 -0.614276
C  -0.681823 1.33564 1.530273
C  -1.820945 0.839824 0.647628
C  -1.823037 -0.454124 0.049215
C  3.639235 -0.675845 -0.174564
C  -0.811696 -2.750868 0.178797
C  -2.907758 1.713831 0.397267
C  -2.91544 -0.822955 -0.785147
C  -4.00205 1.35859 -0.420045
C  3.051461 1.731138 -0.553024
C  -3.978622 0.068386 -1.010732
C  4.329974 -0.552436 1.203238
C  4.657907 -0.765269 -1.335759
C  0.458532 -3.584473 0.385242
C  -5.163983 2.307856 -0.652288
C  2.031292 2.788144 -0.985255
H  1.268565 -1.494392 0.990994
H  1.32213 0.70299 2.143849
H  0.0119 -0.370787 2.694922
H  0.606599 0.810244 -0.941121
H  1.203635 -0.788655 -1.429341
H  -0.194216 2.197797 1.033548
H  -1.095379 1.737241 2.47471
H  3.053975 -1.617036 -0.18129
H  -2.891194 2.706389 0.867924
H  -2.934859 -1.815137 -1.234467
H  -4.806343 -0.246856 -1.657688
H  4.998171 -1.41822 1.366166
H  4.927985 0.371378 1.244563
H  3.588436 -0.530299 2.023143
H  4.142277 -0.873984 -2.307568
H  5.308246 -1.647513 -1.190819
H  5.287124 0.13764 -1.366964
H  0.818217 -3.548244 1.430414
H  1.288305 -3.279707 -0.278384
H  0.188161 -4.625177 0.153394
H  2.573607 3.741951 -1.061766
H  1.585797 2.554743 -1.969753
H  1.208439 2.911259 -0.259359
H  -5.379542 2.425657 -1.730554
H  -6.089922 1.931019 -0.177077
H  -4.959306 3.309492 -0.236255
