program: Gaussian 09
title: 000090728
version: EM64L-G09RevD.01
frameworkgroup: C1[X(C5H8O3)]
method: RPBEPBE
basis: SDD
operation: Freq
keyword: #p
keyword: freq=noraman
keyword: PBEPBE/SDD
title: #p freq=noraman PBEPBE/SDD
converged: YES YES NO NO
title: Mulliken charges:
elementType: O O O C C C C C H H H H H H H H
charge: -0.265580 -0.167460 -0.244924 -0.016365 -0.695137 -0.040116 0.311472 -0.755052 0.251756 0.242896 0.213054 0.246332 0.166687 0.261899 0.246244 0.244294
chargesum: 0.00000
title: Mulliken charges with hydrogens summed into heavy atoms:
elementType: O O O C C C C C
charge: -0.265580 -0.167460 -0.244924 0.235391 0.007144 0.126571 0.311472 -0.002614
polarizability: 7.42787546e+01 3.94827755e+00 5.77122959e+01 -3.85189001e+00 6.04879386e-01 5.44515914e+01
1716.lowfreq: -7.1679 -5.4752 -0.0007 -0.0006 -0.0004 3.8314 53.5452 80.1435 84.8708
frequency: 53.5446 80.1166 84.8401 109.9944 173.9891 200.0593 263.4665 311.1140 397.7935 408.5029 554.9415 598.8522 679.4909 764.9764 849.9767 888.4801 924.7590 996.5048 1037.9483 1042.7399 1114.1719 1132.6880 1193.5108 1259.9778 1304.7897 1374.5769 1383.4070 1393.5699 1453.7185 1454.4588 1462.4762 1479.6313 1651.4428 1668.2460 2868.5102 2982.6064 3000.5212 3007.9977 3098.6183 3101.3574 3112.6790 3142.0785
redmass: 4.3164 2.1461 1.4231 4.1955 2.3234 1.2350 3.8078 4.2266 3.0159 2.9294 3.2130 4.7306 4.6699 3.6387 3.1794 1.3263 2.9487 1.8067 2.3613 1.6796 2.1089 2.2536 2.8387 1.5211 1.3949 1.2095 1.2494 1.2024 1.0559 1.0547 1.0478 1.0486 9.6641 9.3224 1.0851 1.0818 1.0359 1.0378 1.0993 1.0949 1.1013 1.1022
irintensity: 1.2319 5.8207 4.5748 4.9571 8.6850 4.1376 1.2489 4.4212 7.3593 3.3909 1.9294 4.7084 15.4739 16.4996 57.6948 9.6504 14.5699 47.0872 50.4380 9.0079 44.4648 2.8239 266.7573 21.3059 1.7350 11.6567 50.8555 9.4268 24.2677 19.8659 10.8770 12.9354 141.9275 151.0644 118.7472 11.1236 19.4156 1.2815 21.4266 7.6472 15.5652 8.9305
temp: 298.150 k
press: 1.00000 atm
elementType: 8 8 8 6 6 6 6 6 1 1 1 1 1 1 1 1
symmnumber: 1
zpe: 323369.3 jmol-1
zpe.correction: 0.123165 hartree
zpe.thermalcorrener: 0.132695 hartree
zpe.thermalcorrenthalpy: 0.133640 hartree
zpe.thermalcorrgfe: 0.087896 hartree
zpe.sumelectzpe: -420.356306 hartree
zpe.sumelectthermal: -420.346776 hartree
zpe.sumelectthermalent: -420.345831 hartree
zpe.sumelectthermalfe: -420.391575 hartree
dipole: -1.6958 -2.8901 -0.1650
dipole: 3.3550
quadrupole: -37.5338 -51.6620 -50.4427
quadrupole: -0.0737 -6.3707 0.3029
quadrupole: 9.0123 -5.1158 -3.8965 -0.0737 -6.3707 0.3029
hfenergy: -420.4794711 hartree
pointgroup: C01 [X(C5H8O3)]
dipole: -0.7011358 -1.1170559 0.0532974 debye
dipolederiv: -1.5403004 -0.1733969 -0.1049525 -0.2657911 -0.4591255 -0.1260105 -0.0906537 -0.1118893 -0.4200889 -0.4147771 -0.0713275 0.1366034 0.0011545 -0.6427349 0.185406 0.0938417 0.2917927 -0.4648266 -0.6690383 0.004827 0.0562934 -0.2036474 -0.4777059 -0.2692794 -0.2661479 -0.2774437 -0.7758184 0.6484946 0.0370561 0.0073348 -0.0120102 -0.0669695 0.1192565 -0.216965 0.1041716 0.2009549 -0.0485302 0.0572167 -0.0397685 -0.0304324 0.0039481 0.009752 0.0128164 0.0165836 0.0751416 0.5126778 -0.2061822 -0.2701436 -0.1687528 0.8624538 -0.3265383 -0.2271001 -0.3429127 0.4231996 1.7283877 0.1586936 -0.0266967 0.4608913 0.522119 0.4448711 0.3379082 0.4334733 0.9760831 -0.25771 0.0340052 0.1648891 0.0019579 0.0175783 -0.0167601 0.2426428 -0.0655898 -0.2067537 0.0346075 0.0216188 -0.0430064 0.0422925 0.0547543 -0.025072 0.0612689 -0.0255779 -0.0442579 0.0993833 -0.0196717 -0.0090416 -0.0271658 0.0832396 0.0171412 -0.0594149 -0.0332513 -0.1012073 -0.103756 0.0225606 0.0737336 0.0591173 0.0852632 -0.0572194 0.0931042 -0.0350079 0.0540319 0.0882328 0.041401 -0.0280843 0.0229174 -0.100065 0.0673492 -0.0380707 0.0563739 0.0800036 -0.2144255 0.098513 0.1362917 0.10186 0.0093164 0.0082783 0.156288 -0.0135027 0.0015344 0.1036003 0.0389709 -0.0037758 0.0145224 0.0411548 0.0909567 0.0044756 0.0777924 0.0351218 0.0916965 -0.0458206 0.0032936 0.0043078 -0.052401 -0.0853347 -0.0082698 -0.0590722 0.1105016 -0.058543 0.0015361 -0.05297 -0.0012214 0.1191743 -0.0367963 -0.0957237 -0.01594 0.0563804 unknown
polarizability: 74.1845632|3.1056355|57.5794322|-4.8253683|0.3527303|54.6786465 unknown
InChI: InChI=1S/C5H8O3/c1-4(3-6)8-5(2)7/h3-4H,1-2H3
charge 0 multiplicity 1
16 atoms
O  0.217319 -0.772746 -0.283058
O  -0.829837 1.77341 -0.774364
O  1.473069 0.462986 1.248565
C  -1.011021 -0.377668 0.434559
C  -2.089545 -1.423623 0.112438
C  -1.449052 1.030803 0.01425
C  1.418735 -0.210277 0.197642
C  2.561058 -0.543475 -0.730174
H  -0.802401 -0.341959 1.524669
H  -2.25934 -1.48674 -0.975587
H  -3.042731 -1.161901 0.606114
H  -1.770859 -2.414336 0.475438
H  -2.411315 1.35012 0.493751
H  2.556554 0.173333 -1.571432
H  2.447444 -1.555254 -1.150143
H  3.516922 -0.450974 -0.193766
