program: Gaussian 09
title: 000090748
version: EM64L-G09RevD.01
frameworkgroup: C1[X(C21H25NO)]
method: RPBEPBE
basis: SDD
operation: Freq
keyword: #p
keyword: freq=noraman
keyword: PBEPBE/SDD
title: #p freq=noraman PBEPBE/SDD
converged: NO YES NO NO
title: Mulliken charges:
elementType: O N C C C C C C C C C C C C C C C C C C C C C H H H H H H H H H H H H H H H H H H H H H H H H H
charge: -0.439993 -0.088800 0.203376 -0.080755 -0.182538 -0.474638 -0.610414 0.314547 -0.405421 0.280676 -0.798860 -0.799518 -0.500570 -0.544767 -0.372809 0.269484 0.457604 -0.425997 -0.452771 -0.384509 -0.222072 -0.229660 -0.247050 0.210269 0.214576 0.215209 0.200220 0.235861 0.232474 0.215271 0.230262 0.218797 0.212585 0.233523 0.209386 0.229688 0.239736 0.186481 0.222165 0.259217 0.232365 0.218478 0.230461 0.264371 0.352127 0.223024 0.223016 0.225893
chargesum: 0.00000
title: Mulliken charges with hydrogens summed into heavy atoms:
elementType: O N C C C C C C C C C C C C C C C C C C C C C
charge: -0.087867 -0.088800 0.203376 0.129513 0.032038 -0.059209 -0.142079 0.314547 0.040112 0.280676 -0.133956 -0.120707 -0.091923 -0.285550 -0.140444 0.269484 0.457604 -0.207519 -0.222310 -0.120138 0.000953 -0.006644 -0.021157
polarizability: 2.78311302e+02 1.23530361e+01 2.17512734e+02 -2.87046802e+00 -1.71875561e+01 1.85676259e+02
1716.lowfreq: -20.6796 -7.8676 -0.0003 0.0008 0.0008 13.5851 24.2208 29.9962 46.2419
frequency: 23.7822 29.6496 45.6799 55.3272 93.0685 120.5902 157.0648 185.3790 198.9965 212.3786 219.9852 232.0994 260.5143 268.2824 279.9731 292.4653 300.7960 330.7894 343.8549 345.1344 372.2377 400.1596 407.2441 433.6581 438.5187 463.6552 473.2535 474.8005 496.9919 502.1427 528.6522 579.6923 615.2499 617.0996 633.4890 683.4345 689.8574 704.8817 728.0777 737.2756 759.6630 781.9746 791.8744 798.8044 813.5207 838.9927 860.0179 881.4428 889.5476 911.7992 916.3931 922.1797 932.6849 960.9779 976.2557 982.8170 990.0324 996.5483 1000.2710 1016.8512 1019.5948 1024.9674 1040.2697 1064.7253 1073.0649 1082.7414 1109.3123 1119.3684 1131.7798 1145.8650 1152.5062 1153.8790 1168.5412 1170.9188 1178.0137 1184.6654 1192.8570 1206.4635 1210.7973 1232.4727 1240.6428 1250.9318 1255.1336 1276.9878 1293.4114 1303.6888 1316.5142 1324.5727 1343.3008 1348.2414 1350.1892 1365.5542 1377.8844 1382.8469 1384.6412 1392.0995 1393.8330 1438.3228 1440.5827 1451.1445 1454.8675 1461.3693 1469.2482 1481.2794 1482.0385 1482.6903 1485.5686 1491.4273 1498.9035 1587.3435 1594.3751 1614.2651 1629.5291 2841.1931 2878.5581 2958.7181 2975.3696 2976.4092 2977.2280 2979.6082 2980.2307 2989.8918 3006.6944 3028.3681 3041.5305 3063.1788 3064.2021 3078.2592 3083.4391 3106.9205 3109.8218 3120.9702 3130.7456 3134.1962 3145.9284 3159.9689 3166.0229 3583.2389
redmass: 4.7784 4.0091 4.2460 4.3677 4.1545 3.7784 2.5325 3.3700 1.7250 4.2426 2.5509 2.3425 1.7046 2.1183 2.1604 2.2613 1.8238 2.8101 2.6613 1.1499 2.9307 4.0811 2.8812 3.5601 3.5539 3.2227 2.7992 3.6200 3.5802 3.6573 3.9134 3.6708 3.6751 5.9396 3.3066 5.6161 4.3693 2.2190 3.0267 1.8754 2.3714 2.8484 1.5567 2.6793 2.9859 2.1155 1.2493 1.7180 2.0804 2.2973 1.4091 1.7293 1.7824 2.0156 1.8180 1.3788 6.0168 1.5804 1.5309 1.6477 1.5672 2.0877 2.3702 2.2033 1.9040 2.0487 2.5029 2.0504 2.1909 1.4392 1.5445 1.9304 1.0702 1.8816 1.1207 1.7041 1.4787 2.2739 2.1249 1.6693 1.4040 2.3028 1.7182 1.4798 1.7391 1.3689 1.3974 1.4091 1.5666 1.4919 1.5207 1.3835 2.0959 2.5798 1.7563 1.6018 1.5812 2.0452 2.1532 1.1511 1.2108 1.1447 1.0714 1.6086 1.1879 1.2372 1.0655 1.5726 1.3731 7.1338 6.1428 6.1486 6.4846 1.0702 1.0709 1.0643 1.0385 1.0420 1.0797 1.0718 1.0688 1.0834 1.0972 1.0875 1.1025 1.0984 1.0985 1.0992 1.0986 1.0865 1.0870 1.0861 1.0969 1.0914 1.0952 1.1013 1.0905 1.0659
irintensity: 0.1018 0.0393 0.0595 0.1565 0.4423 2.4734 0.1538 1.2405 0.1801 1.4159 2.6256 1.7948 1.2644 1.9496 1.8006 0.3213 1.1239 3.2873 17.3468 120.4461 6.3181 5.6330 0.7086 1.4358 2.6363 2.3505 8.3519 8.7793 2.7146 4.4811 0.9276 2.6322 0.0737 0.7655 3.7094 0.7311 10.2468 34.2218 15.3692 30.9286 32.6299 5.7601 27.4094 13.4684 10.2681 8.8153 0.3267 5.0580 15.2340 35.2392 8.7439 11.5567 6.9864 11.3829 5.6891 0.1963 0.0292 2.9560 2.8277 7.9553 7.0377 20.0662 3.6131 10.0974 25.3837 9.6827 32.0974 5.1979 48.8734 29.8702 124.2663 12.9200 0.7277 2.6206 2.3118 8.1454 6.5441 4.7869 28.0212 2.6969 3.5446 12.8997 2.1597 28.9761 28.6460 5.1187 23.4227 1.8306 17.2866 5.1619 12.7243 7.0403 11.2501 12.9430 13.8036 10.0482 8.4475 9.8927 7.1369 8.7762 11.7195 12.5419 13.1147 17.2856 4.7672 0.9528 16.4963 47.3581 36.2651 31.0954 1.0159 9.6694 51.0884 62.3712 68.3553 11.8066 8.1028 32.2860 5.7315 11.2888 85.9882 74.3177 27.9112 36.0084 31.0803 35.7657 41.4840 45.5299 24.7554 16.1500 9.0974 0.2295 25.9186 20.2059 32.3440 32.1110 4.3854 35.6345
temp: 298.150 k
press: 1.00000 atm
elementType: 8 7 6 6 6 6 6 6 6 6 6 6 6 6 6 6 6 6 6 6 6 6 6 1 1 1 1 1 1 1 1 1 1 1 1 1 1 1 1 1 1 1 1 1 1 1 1 1
symmnumber: 1
zpe: 1070094.1 jmol-1
zpe.correction: 0.407577 hartree
zpe.thermalcorrener: 0.427881 hartree
zpe.thermalcorrenthalpy: 0.428825 hartree
zpe.thermalcorrgfe: 0.358917 hartree
zpe.sumelectzpe: -943.519769 hartree
zpe.sumelectthermal: -943.499465 hartree
zpe.sumelectthermalent: -943.498521 hartree
zpe.sumelectthermalfe: -943.568429 hartree
dipole: -0.4683 -1.1899 1.3456
dipole: 1.8563
quadrupole: -135.7160 -126.0321 -137.6074
quadrupole: 7.2225 -6.1001 -4.3722
quadrupole: -2.5975 7.0864 -4.4889 7.2225 -6.1001 -4.3722
hfenergy: -943.927346 hartree
pointgroup: C01 [X(C21H25N1O1)]
dipole: -0.2019987 -0.3030171 0.6330306 debye
polarizability: 279.0384747|9.5211295|205.7286004|-5.4679071|-22.6423807|196.7332197 unknown
InChI: InChI=1S/C21H25NO/c1-15-20-12-17-8-9-18(23)13-19(17)21(15,2)10-11-22(20)14-16-6-4-3-5-7-16/h3-9,13,15,20,23H,10-12,14H2,1-2H3
charge 0 multiplicity 1
48 atoms
O  -5.373281 -1.816725 -1.189384
N  1.098024 0.533154 0.313952
C  -1.462986 1.236154 -0.986219
C  -0.780427 2.144155 0.091627
C  0.020625 1.242231 1.063884
C  -0.316352 0.465986 -1.729847
C  -0.955593 0.316213 1.852839
C  -2.385515 0.206842 -0.300957
C  0.594502 -0.332028 -0.78177
C  -2.103006 -0.25411 1.021228
C  -2.212255 2.105823 -2.027039
C  -1.761165 3.070697 0.843233
C  2.082105 -0.151066 1.178958
C  -3.485607 -0.345038 -0.999457
C  -2.935941 -1.245721 1.593515
C  -4.301022 -1.332693 -0.411237
C  3.41893 -0.410192 0.483369
C  -4.031792 -1.795298 0.897675
C  4.164803 -1.57797 0.777278
C  3.95466 0.53133 -0.430833
C  5.427427 -1.798633 0.180042
C  5.213141 0.312267 -1.033059
C  5.95663 -0.852777 -0.727761
H  -0.036265 2.772675 -0.439956
H  0.537286 1.893218 1.79788
H  0.294964 1.209364 -2.279085
H  -0.759856 -0.222667 -2.474802
H  -1.382222 0.898201 2.695887
H  -0.385462 -0.509545 2.323148
H  0.046207 -1.221314 -0.385352
H  1.465958 -0.716298 -1.343007
H  -1.560493 2.934774 -2.361831
H  -2.483236 1.521352 -2.92549
H  -3.139589 2.540368 -1.61477
H  -1.239347 3.613772 1.654237
H  -2.192948 3.826862 0.164401
H  -2.598691 2.506761 1.291796
H  1.702698 -1.124593 1.583255
H  2.255414 0.504228 2.05769
H  -3.734419 -0.01703 -2.012236
H  -2.720908 -1.597241 2.610636
H  -4.659919 -2.56522 1.364441
H  3.754469 -2.320687 1.473811
H  3.360132 1.421479 -0.665418
H  -5.886035 -2.499666 -0.690283
H  5.992208 -2.707929 0.416313
H  5.615405 1.047465 -1.739904
H  6.933144 -1.023629 -1.195199
