program: Gaussian 09
title: 000090931
version: EM64L-G09RevD.01
frameworkgroup: C1[X(C23H28O4)]
method: RPBEPBE
basis: SDD
operation: Freq
keyword: #pfreq=noraman
keyword: PBEPBE/SDD
title: #p freq=noraman PBEPBE/SDD
converged: NO YES NO NO
title: Mulliken charges:
elementType: O O O O C C C C C C C C C C C C C C C C C C C C C C C H H H H H H H H H H H H H H H H H H H H H H H H H H H H
charge: -0.205859 -0.235205 -0.241413 -0.243456 -0.154750 -0.238747 0.206750 0.391334 0.030087 -0.534730 -0.471382 -0.568556 0.301407 -0.424040 0.567798 -0.638460 -0.800214 -0.481615 -0.357548 -0.755615 -0.564065 -0.578007 0.090572 0.177985 -0.408747 0.302795 -0.753159 0.227812 0.206735 0.248033 0.233216 0.217586 0.235656 0.228313 0.244277 0.240872 0.214122 0.244077 0.262703 0.205888 0.224788 0.228763 0.208474 0.243007 0.234055 0.233669 0.215343 0.248750 0.229439 0.254511 0.246864 0.257928 0.262699 0.246869 0.242394
chargesum: 0.00000
title: Mulliken charges with hydrogens summed into heavy atoms:
elementType: O O O O C C C C C C C C C C C C C C C C C C C C C C C
charge: -0.205859 -0.235205 -0.241413 -0.243456 0.073061 -0.032012 0.206750 0.391334 0.030087 -0.053481 -0.018140 -0.095966 0.301407 -0.183168 0.567798 -0.180261 -0.106837 -0.044379 -0.114541 -0.072548 -0.085876 -0.323496 0.090572 0.177985 0.096046 0.302795 -0.001196
polarizability: 3.30191501e+02 -2.51678755e+00 2.35927752e+02 -6.97642263e+00 8.23367376e+00 1.99615224e+02
1716.lowfreq: -10.8148 -0.0008 -0.0005 0.0003 4.3691 7.1140 14.3031 23.5816 27.9676
frequency: 13.9065 23.4760 27.7884 36.2264 53.5222 57.9430 84.1669 86.3311 95.8257 129.8966 152.2608 163.0661 170.0678 186.9126 193.8691 198.6520 226.1998 239.3715 252.6752 258.9075 265.0283 268.1454 268.9877 282.5653 314.1992 328.2615 334.3735 369.7236 387.0050 405.6090 420.1352 432.2834 446.6568 459.8653 475.7491 512.3793 522.7519 531.8482 553.3391 557.2841 590.2619 598.5728 615.1191 627.3663 651.8983 656.0534 679.4236 702.6475 738.4281 775.2704 787.3587 796.2604 804.4992 818.4995 822.1560 838.4601 851.3270 876.1951 890.4222 903.0896 924.0570 928.1726 932.8737 950.4518 959.2559 971.2384 983.4714 1000.0978 1004.8641 1009.6881 1023.3115 1032.4761 1039.8554 1042.1097 1045.6546 1053.3882 1074.5954 1085.2358 1104.2889 1109.4089 1125.4580 1138.4312 1144.9142 1151.3551 1155.5353 1182.2297 1192.3692 1196.8747 1204.0847 1218.6717 1227.6984 1231.8480 1239.1709 1253.7058 1270.1605 1272.3597 1278.8046 1284.7875 1298.2386 1316.7185 1319.1001 1321.8945 1326.9208 1333.5891 1338.5798 1343.9839 1346.9802 1350.4191 1370.9319 1379.5639 1384.8066 1387.7952 1418.4009 1446.3305 1447.6018 1451.2325 1453.0611 1454.7267 1463.1620 1464.4358 1466.9184 1471.7757 1473.7328 1487.1342 1490.8377 1583.2220 1584.8760 1602.0964 1623.0699 1665.4817 1672.5077 2916.2040 2941.6537 2947.1617 2955.3151 2962.9295 2979.7379 2980.0000 2983.8472 2984.3797 2986.3729 3006.7125 3008.7752 3029.3703 3032.3082 3038.8534 3045.4918 3047.5711 3062.5050 3070.9252 3083.4741 3084.3277 3095.5195 3097.1179 3101.2269 3119.4315 3131.9296 3142.2377 3146.8056
redmass: 4.2332 6.3842 5.7732 3.9213 4.4509 4.5723 1.2646 5.2548 3.1168 3.3673 4.3941 3.9943 3.4760 3.1104 2.6682 1.3521 3.0110 1.3892 2.2912 2.5262 2.3902 1.9800 2.6554 2.7332 5.9180 3.0419 2.6922 3.4633 2.9003 3.2622 3.2883 3.7319 3.7103 3.2346 3.7834 3.4833 3.7634 2.5222 3.4059 3.2460 3.3735 3.9359 4.9295 3.9859 3.9992 4.2031 2.9135 3.0680 5.0576 2.1872 3.9907 2.3953 2.4483 1.9439 1.5049 1.9691 2.6001 1.8737 1.8079 2.1330 2.1963 1.9469 1.8230 2.0164 2.0248 2.2121 2.1636 2.1634 2.1964 2.1116 2.0010 3.6253 2.0165 1.7200 2.3189 2.1396 2.2199 2.2549 1.6939 2.5773 1.5472 1.8787 1.8271 2.2144 1.8245 1.6321 2.3121 2.7171 1.6438 1.8117 2.1902 1.5642 1.1535 1.5313 1.4610 1.3855 2.0211 1.3643 1.8440 1.4198 1.4184 1.4767 1.7160 1.6281 1.8115 1.9484 1.7789 1.4416 1.5439 1.2274 1.2402 1.2243 1.1077 1.0971 1.0787 1.0840 1.0546 1.0552 1.0764 1.0786 1.0777 1.0554 1.0753 1.0583 1.0592 8.8979 10.0321 7.4557 7.7815 9.3951 7.5774 1.0811 1.0674 1.0694 1.0675 1.0799 1.0648 1.0415 1.0562 1.0381 1.0568 1.0597 1.0381 1.0935 1.0925 1.0940 1.1012 1.1019 1.0959 1.0985 1.0989 1.1003 1.1006 1.0986 1.0953 1.0913 1.0893 1.1021 1.0953
irintensity: 0.9540 0.3510 1.1913 0.3075 3.2909 1.0530 2.6609 2.4091 5.2021 0.3487 3.0667 2.0508 0.5077 2.9093 0.3868 0.2172 1.0407 0.0645 0.1694 0.7488 4.6214 0.4870 10.5262 1.2518 6.2358 5.4309 1.6083 4.0458 3.7960 0.6011 0.8943 11.7425 0.8269 4.6681 2.3204 5.2908 1.5467 0.2265 0.2501 2.9826 2.3947 3.2583 5.4691 0.4919 1.2957 1.8086 10.8084 1.4477 32.4681 8.5533 20.8419 20.6933 0.3416 1.8862 14.7707 6.0456 1.9253 5.0362 20.0717 59.9511 5.4013 42.6412 8.9574 5.8544 1.3678 3.2477 49.4986 17.9785 8.8986 14.4328 8.6122 51.8167 6.7325 15.0599 6.9093 5.4702 3.1434 1.0248 2.0282 0.2171 3.0986 2.2713 1.1470 5.5850 8.8284 26.1652 118.2048 185.5575 38.6150 3.0376 10.9875 38.4518 12.1565 1.1612 2.8068 1.8766 39.8162 1.3220 8.8860 4.3605 1.3795 15.2022 7.4793 11.6734 9.6385 31.6164 16.9577 1.1985 5.8176 11.3792 55.8711 29.6629 29.1105 19.3646 17.3026 16.4606 19.1498 22.1134 9.9168 13.4885 5.8307 11.4768 0.3100 8.4194 11.1779 55.2367 175.6044 110.8836 180.8750 151.4041 8.0249 20.5640 18.8355 12.6227 28.8625 15.5253 13.3615 12.6095 58.2098 41.9957 18.9948 25.8374 3.8322 27.7389 3.9642 40.7047 18.0362 34.0916 20.2078 34.4877 31.6676 28.2418 3.0488 9.8666 9.0245 10.7325 18.4679 9.4740 21.6197
temp: 298.150 k
press: 1.00000 atm
elementType: 8 8 8 8 6 6 6 6 6 6 6 6 6 6 6 6 6 6 6 6 6 6 6 6 6 6 6 1 1 1 1 1 1 1 1 1 1 1 1 1 1 1 1 1 1 1 1 1 1 1 1 1 1 1 1
symmnumber: 1
zpe: 1198513.6 jmol-1
zpe.correction: 0.456490 hartree
zpe.thermalcorrener: 0.482553 hartree
zpe.thermalcorrenthalpy: 0.483497 hartree
zpe.thermalcorrgfe: 0.398967 hartree
zpe.sumelectzpe: -1192.097841 hartree
zpe.sumelectthermal: -1192.071778 hartree
zpe.sumelectthermalent: -1192.070834 hartree
zpe.sumelectthermalfe: -1192.155363 hartree
dipole: -3.0882 5.3463 2.0175
dipole: 6.4954
quadrupole: -199.5016 -153.3012 -163.4334
quadrupole: 8.9519 17.8759 -1.2181
quadrupole: -27.4229 18.7776 8.6453 8.9519 17.8759 -1.2181
hfenergy: -1192.5543305 hartree
pointgroup: C01 [X(C23H28O4)]
dipole: -1.2384178 -2.1953045 -0.421243 debye
polarizability: 330.246384|2.6741433|237.5750644|6.5982006|1.5229014|197.9130285 unknown
InChI: InChI=1S/C23H28O4/c1-14(24)27-13-21(26)20-7-6-18-17-5-4-15-12-16(25)8-10-22(15,2)19(17)9-11-23(18,20)3/h7,9,12,17-18H,4-6,8,10-11,13H2,1-3H3
charge 0 multiplicity 1
55 atoms
O  -3.679566 1.231327 0.688443
O  6.91174 1.890153 0.708057
O  -6.17533 0.139704 0.549219
O  -6.101838 1.077113 -1.586546
C  -0.218333 -1.582997 0.292477
C  1.315535 -1.431705 0.077572
C  -1.054489 -0.260388 0.453327
C  1.767799 -0.081027 -0.488312
C  3.293632 0.080934 -0.752003
C  -0.62437 0.791398 -0.61815
C  2.110595 -1.734255 1.380053
C  -0.973464 -2.382206 -0.811908
C  -2.470342 -0.765333 0.098884
C  0.877508 0.908231 -0.771822
C  4.102397 -0.44341 0.453683
C  3.63062 -1.728603 1.106484
C  -0.927467 0.336914 1.873168
C  3.672581 1.567186 -1.025379
C  -2.406872 -1.935137 -0.614127
C  3.663212 -0.786382 -2.009467
C  5.192678 1.82862 -1.038537
C  5.238257 0.180506 0.90427
C  -3.705004 0.013687 0.34804
C  5.858479 1.349093 0.250171
C  -5.052339 -0.72369 0.172466
C  -6.56266 1.082738 -0.425382
C  -7.574523 2.041371 0.151084
H  -0.366905 -2.151345 1.234762
H  1.616583 -2.2209 -0.648369
H  -1.061251 1.771434 -0.351341
H  -1.067558 0.528794 -1.602303
H  1.81114 -2.724341 1.775845
H  1.862273 -0.981316 2.152304
H  -0.837856 -3.476562 -0.724934
H  -0.625285 -2.098754 -1.829513
H  1.232503 1.865346 -1.170347
H  3.858271 -2.577779 0.425062
H  4.200164 -1.910834 2.035804
H  -1.607461 1.196085 1.996553
H  -1.174084 -0.414924 2.646237
H  0.106218 0.68481 2.050073
H  3.218413 2.196783 -0.235913
H  3.237593 1.888327 -1.990682
H  -3.259334 -2.458874 -1.060915
H  3.091846 -0.428226 -2.884687
H  4.741503 -0.715502 -2.237555
H  3.424845 -1.853848 -1.8601
H  5.413222 2.902555 -1.171419
H  5.678879 1.302245 -1.885305
H  5.774825 -0.210835 1.77864
H  -5.162371 -1.049963 -0.879233
H  -5.112171 -1.593528 0.846366
H  -7.039222 2.809837 0.737763
H  -8.265254 1.521035 0.833503
H  -8.12936 2.535135 -0.66006
