program: Gaussian 09
title: 000095849
version: EM64L-G09RevD.01
frameworkgroup: C1[X(C5H11NO2)]
method: RPBEPBE
basis: SDD
operation: Freq
keyword: #p
keyword: freq=noraman
keyword: PBEPBE/SDD
title: #p freq=noraman PBEPBE/SDD
converged: YES YES NO NO
title: Mulliken charges:
elementType: O O N C C C C C H H H H H H H H H H H
charge: -0.261274 -0.255592 -0.325549 -0.428616 -0.225950 0.251286 -0.671708 -0.614572 0.249738 0.208791 0.228802 0.232345 0.297710 0.212396 0.231930 0.229920 0.190525 0.226797 0.223022
chargesum: 0.00000
title: Mulliken charges with hydrogens summed into heavy atoms:
elementType: O O N C C C C C
charge: -0.261274 -0.255592 -0.027840 0.029913 0.235198 0.251286 0.002538 0.025771
polarizability: 9.14172791e+01 1.44834896e+00 6.49218647e+01 7.62339555e-01 -5.93105545e-01 5.06852223e+01
1716.lowfreq: -9.3432 -1.9980 -0.0006 -0.0004 -0.0004 11.1340 40.7414 64.1917 93.7105
frequency: 40.5682 64.0550 93.6967 119.0201 153.0883 219.2804 231.8931 252.1838 316.9057 353.2729 414.3516 560.9110 603.7494 692.0671 798.4610 812.8841 911.8515 983.1861 987.1776 1025.2089 1112.8133 1115.0756 1134.2110 1137.2047 1174.5164 1191.0393 1217.3767 1248.6310 1336.7545 1362.8145 1401.7394 1437.3364 1456.1932 1461.4337 1463.8032 1474.1385 1476.5158 1486.6395 1494.2158 1638.6441 2820.6806 2861.7037 2996.7085 3004.7707 3007.7584 3012.0116 3071.0947 3078.8201 3093.1072 3109.4118 3486.3521
redmass: 2.6398 2.4549 2.7419 2.5536 2.2298 1.4242 2.1770 1.3346 3.6775 4.0690 3.4916 3.2737 1.3271 4.9678 1.1017 3.5576 4.3646 2.1176 1.7989 2.3894 2.1152 1.3580 1.7283 1.6124 4.2936 1.2776 2.8053 1.1359 1.4013 1.4881 1.2688 1.1440 1.1772 1.1118 1.0401 1.0608 1.1075 1.0706 1.0502 9.1585 1.0717 1.0574 1.0359 1.0759 1.0838 1.0586 1.1066 1.0974 1.0984 1.1027 1.0754
irintensity: 0.4893 1.9186 3.1824 1.9067 4.5126 3.6536 9.4450 1.0281 1.8399 17.2877 8.9096 9.5167 125.8747 10.0866 4.2509 6.1881 4.7130 22.8134 5.9879 70.3928 10.5050 0.5348 67.5952 36.2412 294.7441 62.6046 2.5153 0.0645 40.0053 12.8975 18.0273 0.9519 21.2094 20.1537 12.4300 1.8505 20.2027 14.1943 18.9141 181.6041 84.5483 160.0953 20.0398 59.7529 24.6765 19.6958 8.0048 35.3468 29.2712 45.0663 12.4408
temp: 298.150 k
press: 1.00000 atm
elementType: 8 8 7 6 6 6 6 6 1 1 1 1 1 1 1 1 1 1 1
symmnumber: 1
zpe: 418677.0 jmol-1
zpe.correction: 0.159466 hartree
zpe.thermalcorrener: 0.169625 hartree
zpe.thermalcorrenthalpy: 0.170569 hartree
zpe.thermalcorrgfe: 0.123281 hartree
zpe.sumelectzpe: -401.653157 hartree
zpe.sumelectthermal: -401.642998 hartree
zpe.sumelectthermalent: -401.642054 hartree
zpe.sumelectthermalfe: -401.689342 hartree
dipole: -1.1253 -1.3958 1.0609
dipole: 2.0832
quadrupole: -38.2794 -52.8378 -50.0013
quadrupole: -1.6301 2.4801 0.2520
quadrupole: 8.7601 -5.7983 -2.9618 -1.6301 2.4801 0.2520
hfenergy: -401.8126226 hartree
pointgroup: C01 [X(C5H11N1O2)]
dipole: -0.4532589 -0.5960285 0.3332688 debye
dipolederiv: -1.7130136 -0.2099084 -0.0919903 -0.2683255 -0.5362363 -0.0565055 -0.0948906 -0.0494201 -0.2877763 -0.7184371 0.0586711 -0.0055796 -0.303221 -0.9163881 -0.0982747 -0.0849765 -0.09791 -0.3296485 -0.726616 0.0213066 -0.0232895 0.0957682 -0.3877613 0.1697151 0.0444627 0.21063 -0.5870634 0.1753599 0.2870673 -0.0813606 0.5102707 0.0648432 -0.095459 -0.0913246 -0.0419863 0.4216866 0.8959483 -0.0032052 0.011848 -0.1771167 0.2467963 -0.0204939 -0.023882 -0.020373 0.3534526 1.6777034 0.0782918 0.0993929 0.5015217 1.2014455 0.1637039 0.2309668 0.1506017 0.2271404 -0.1114549 -0.0733029 -0.0173706 -0.0576688 0.0121461 -0.0101651 -0.0128337 -0.011646 0.0572734 0.4572904 -0.1597661 0.1052534 -0.2919633 0.2749799 -0.0864646 0.0537922 -0.079664 0.3987475 0.0205216 -0.0322395 -0.0133693 -0.1077586 -0.0224333 -0.0777001 -0.022392 -0.1159193 -0.0157951 -0.0535652 0.0116466 0.000533 -0.0897028 -0.0193398 0.1145206 0.0998689 0.1478126 -0.1668681 -0.0414639 -0.0171786 -0.0358498 0.0596654 0.0280567 -0.0721479 0.0203451 -0.0897867 -0.094993 -0.0399053 -0.0326405 0.0240818 0.0602619 -0.0362831 0.0927603 0.0029161 0.1057203 -0.021229 0.1929341 0.0260084 0.0048232 -0.0466885 0.1480061 -0.0718203 -0.0070262 -0.1704759 0.2455261 -0.1307839 0.079253 0.0095161 0.1022833 0.0292033 -0.0140485 0.0144397 -0.0141102 0.1141777 0.1079581 0.0065964 0.0315922 -0.0411603 0.0465141 -0.0862776 -0.0068649 -0.0971859 -0.0975826 0.1075697 0.0122445 -0.022235 -0.0459583 -0.0323636 0.1102556 -0.002893 0.1240824 -0.0226136 -0.0402508 0.024163 -0.0038431 0.136442 -0.0022073 0.1220108 -0.1528595 0.137052 -0.2604162 -0.1209645 -0.0802659 0.0293031 -0.1493124 -0.000855 0.0371656 0.0198004 0.0481609 0.0974205 0.0611698 0.0032585 -0.0214558 0.1126631 -0.0981234 -0.1207749 0.013351 -0.1355826 -0.0314389 unknown
polarizability: 91.4455348|0.8999109|64.7644147|1.1170493|1.4291674|50.8144166 unknown
InChI: InChI=1S/C5H11NO2/c1-3-8-5(7)4-6-2/h6H,3-4H2,1-2H3
charge 0 multiplicity 1
19 atoms
O  -1.194299 -0.474778 -0.039217
O  0.029712 1.476859 0.328559
N  2.404298 0.100702 -0.230717
C  1.1977 -0.677136 0.044868
C  -2.464201 0.311474 0.081981
C  -0.013533 0.241593 0.119103
C  -3.610488 -0.674206 -0.116075
C  3.671939 -0.589774 0.029177
H  1.02083 -1.442854 -0.734548
H  1.234585 -1.232626 1.020768
H  -2.4810 0.790472 1.077801
H  -2.449631 1.108049 -0.68332
H  2.339884 1.054277 0.144026
H  -4.576999 -0.143795 -0.037257
H  -3.55455 -1.148738 -1.110483
H  -3.585975 -1.467317 0.650525
H  3.783424 -0.966879 1.077069
H  4.51323 0.09317 -0.180875
H  3.777373 -1.460093 -0.646586
