program: Gaussian 09
title: 000095853
version: EM64L-G09RevD.01
frameworkgroup: C1[X(C9H15NO2)]
method: RPBEPBE
basis: SDD
operation: Freq
keyword: #p
keyword: freq=noraman
keyword: PBEPBE/SDD
title: #p freq=noraman PBEPBE/SDD
converged: YES YES NO NO
title: Mulliken charges:
elementType: O O N C C C C C C C C C H H H H H H H H H H H H H H H
charge: -0.213163 -0.213860 -0.347469 0.356050 -0.405831 -0.533496 -0.546324 -0.752268 -0.396465 0.122144 0.122984 -0.691151 0.191275 0.203270 0.255541 0.246833 0.245717 0.261016 0.218301 0.224174 0.230531 0.213803 0.213903 0.350693 0.211708 0.210499 0.221583
chargesum: 0.00000
title: Mulliken charges with hydrogens summed into heavy atoms:
elementType: O O N C C C C C C C C C
charge: -0.213163 -0.213860 0.003224 0.356050 -0.011285 -0.031122 -0.039591 -0.079262 0.031242 0.122144 0.122984 -0.047361
polarizability: 1.23320271e+02 3.42545179e+00 1.15878648e+02 -2.55012926e+00 1.01106223e+00 8.14547583e+01
1716.lowfreq: -11.9298 -4.3342 -0.0008 -0.0006 -0.0004 9.8260 54.3566 76.2035 76.5847
frequency: 54.1252 76.1804 76.5809 109.1053 140.8477 169.1148 218.4120 234.1268 278.2383 290.5892 318.3117 344.6256 347.2102 410.3010 449.2585 511.3778 536.0473 554.8924 589.2440 626.0158 739.3270 791.9062 806.7443 844.0858 855.7726 889.8126 899.7607 917.3701 929.8599 969.0752 978.8459 1043.3446 1053.4473 1094.6160 1136.4337 1140.1912 1164.5099 1221.3524 1240.5916 1256.9578 1277.7175 1283.9740 1300.0969 1313.4970 1323.2500 1330.2091 1354.9718 1370.6734 1388.0645 1397.6080 1435.0295 1442.2763 1458.5026 1472.5827 1477.6941 1479.0483 1484.0824 1487.5110 1637.5068 1640.6707 2945.6513 2972.6975 2973.5930 2974.6902 2981.8704 2983.2133 2997.3362 3036.0586 3068.5910 3071.1478 3073.5898 3075.9122 3077.0833 3084.1678 3483.4041
redmass: 1.7614 2.8014 3.6657 3.9898 4.3586 2.8087 1.1312 1.1851 2.5087 3.3153 2.2894 3.8435 3.3301 2.5124 4.2796 4.3154 2.6252 4.2637 3.3223 3.9553 1.1176 2.1559 1.5511 3.4585 1.4014 1.8242 2.0664 2.4552 2.2152 1.8280 1.8607 1.5950 2.5853 1.9924 1.6869 1.6171 1.9046 1.5946 1.6643 2.5881 1.3717 1.5661 1.5408 2.0195 2.4506 1.6291 1.5143 1.8508 1.2097 1.1978 1.0823 1.0797 1.0772 1.0605 1.0430 1.0542 1.0655 1.0712 10.4627 5.5894 1.0594 1.0645 1.0384 1.0638 1.0528 1.0458 1.0986 1.1017 1.0942 1.1008 1.0988 1.0988 1.0943 1.0983 1.0760
irintensity: 0.1939 1.1914 0.2702 2.7014 5.3709 0.9950 0.0663 0.0509 0.7881 1.5110 0.9545 12.0697 5.2779 7.0320 10.5264 3.7143 3.4599 13.6076 6.8450 0.7768 7.2221 31.9257 74.1642 10.8540 0.6742 0.1771 1.0277 2.7034 10.9751 5.3650 1.4490 2.5158 1.5727 3.7384 11.7040 25.2745 9.7647 8.3956 5.0684 150.0953 12.5639 89.0370 28.6273 46.3311 77.6032 5.7730 0.7426 10.6160 9.9311 24.1251 4.9729 3.6536 2.5452 1.6531 14.1628 8.2180 2.6233 18.6431 159.0914 448.5924 24.5778 6.5190 36.7618 26.6195 18.2631 24.6888 15.5143 16.8430 1.0290 52.9619 65.9180 30.5156 13.2302 34.3330 36.1047
temp: 298.150 k
press: 1.00000 atm
elementType: 8 8 7 6 6 6 6 6 6 6 6 6 1 1 1 1 1 1 1 1 1 1 1 1 1 1 1
symmnumber: 1
zpe: 600899.7 jmol-1
zpe.correction: 0.228871 hartree
zpe.thermalcorrener: 0.241624 hartree
zpe.thermalcorrenthalpy: 0.242568 hartree
zpe.thermalcorrgfe: 0.189813 hartree
zpe.sumelectzpe: -556.248295 hartree
zpe.sumelectthermal: -556.235542 hartree
zpe.sumelectthermalent: -556.234598 hartree
zpe.sumelectthermalfe: -556.287353 hartree
dipole: 4.0447 -0.7229 -0.3021
dipole: 4.1199
quadrupole: -80.1527 -88.3311 -70.8038
quadrupole: -2.2027 -0.0829 -0.4319
quadrupole: -0.3901 -8.5686 8.9587 -2.2027 -0.0829 -0.4319
hfenergy: -556.4771659 hartree
pointgroup: C01 [X(C9H15N1O2)]
dipole: -1.5867834 0.2986674 -0.1422433 debye
dipolederiv: -0.8502498 -0.4102615 0.0086184 -0.236761 -0.9368273 0.0216147 -0.0604718 -0.0232835 -0.3437068 -0.6327127 0.2565135 -0.0138757 0.0943458 -1.1393779 0.0336702 -0.0447652 0.0938866 -0.3484478 -0.5234527 -0.239453 0.0211073 -0.2375794 -1.5737123 0.0459922 0.0243666 0.048075 -0.3176792 0.1039637 -0.0032102 -0.0442269 -0.0391758 0.0855851 0.0189747 -0.018447 0.0220526 0.1404768 0.0239418 -0.0241865 0.0087188 -0.0337135 0.099025 0.0267656 0.0100924 0.0252053 0.1089305 -0.3471132 0.0225651 -0.0443053 0.0681882 -0.0043 0.0200912 -0.1187076 0.0350988 0.0700379 -0.3270107 0.0817251 -0.050161 0.0706652 -0.0406146 0.0075459 -0.1318698 0.0149219 0.0677413 -0.0088142 0.0013008 -0.0125378 0.0173295 0.0395247 0.006647 -0.0133046 -0.0011341 -0.0809498 -0.0147631 -0.006329 -0.0229756 0.0214422 0.0947967 0.0471169 -0.0589681 0.0436823 0.1172569 1.0426823 0.0227552 0.0534891 0.2153098 1.7000536 -0.0606922 0.1306361 -0.0660676 0.2083795 1.0912949 0.2803878 0.0342559 0.068002 1.6681161 -0.0716627 0.125274 -0.096242 0.2086337 -0.0447805 0.0121846 -0.0323023 -0.0221311 0.0794874 0.0096564 -0.0073236 0.0130727 0.0815113 0.0300737 -0.0103571 0.0155234 -0.0187909 0.0588917 -0.00469 0.0082148 0.024535 -0.1956485 0.0122528 0.0337542 0.0080909 0.0547967 -0.1557375 -0.0441367 0.0245674 -0.072742 0.0533342 0.055715 0.02425 0.0156341 0.019152 -0.0585781 -0.0437948 0.0300687 -0.0784926 0.0792887 0.0583901 0.0118449 -0.023864 -0.0066928 0.095096 -0.016956 0.0067363 0.0224164 -0.1021745 0.0666254 0.0033575 -0.0223073 0.0225039 0.0795763 0.003117 -0.0116881 -0.0391071 -0.0973878 0.0432581 -0.0552161 0.0341246 -0.066394 -0.0161385 0.0416287 0.0689879 0.0577765 0.0642728 0.0698519 0.0718125 0.0434985 0.082577 -0.1010216 -0.0923707 0.0264209 -0.0344532 0.0459545 0.0211366 -0.0894051 0.0868229 -0.1158065 -0.0268921 0.0760698 0.0706593 0.0396879 0.0369704 -0.1310643 0.0230048 -0.1090253 0.0231096 0.0778247 0.0118418 -0.0736738 0.0103917 0.0604989 0.0568871 -0.0010678 -0.0150632 -0.0067258 0.0607645 0.0066914 0.0018511 0.0259091 -0.1780688 0.0359424 0.0699741 0.0153594 0.0566036 -0.1529521 -0.0416538 0.0206664 -0.057247 0.0517505 0.1696914 -0.0104912 -0.0171127 -0.0137668 0.1220241 0.0112701 -0.0332317 0.0133974 0.316224 0.0586351 0.0267261 -0.005937 0.1035205 -0.1406614 -0.0614548 0.0062838 -0.0785849 0.0604101 0.0701549 0.0086247 0.0356532 0.0229329 0.0871679 0.0015195 -0.0412404 0.0036053 -0.1807433 -0.1305362 -0.1008034 0.0327978 -0.1429412 -0.0011206 0.0471987 0.0588659 0.0536394 0.0731347 unknown
polarizability: 123.3310173|3.4142233|115.7548375|2.9376327|-1.6644911|81.5678222 unknown
InChI: InChI=1S/C9H15NO2/c1-3-4-9(2)5-7(11)10-8(12)6-9/h10H,3-6H2,1-2H3
charge 0 multiplicity 1
27 atoms
O  2.827854 1.941771 -0.133485
O  1.861629 -2.58375 0.037654
N  2.276106 -0.308018 -0.079374
C  -0.514915 0.298193 0.176623
C  -1.951949 0.625388 -0.334068
C  0.457736 1.349144 -0.434594
C  -0.071882 -1.106129 -0.323818
C  -0.452124 0.365732 1.726142
C  -3.084643 -0.319672 0.130208
C  1.933627 1.057672 -0.199003
C  1.403222 -1.419081 -0.101483
C  -4.455753 0.10786 -0.43869
H  -1.938009 0.636044 -1.445358
H  -2.203972 1.659794 -0.018468
H  0.259244 2.359983 -0.037872
H  0.305343 1.403311 -1.533133
H  -0.264749 -1.191412 -1.413956
H  -0.642288 -1.914912 0.162285
H  -0.808168 1.348386 2.086699
H  -1.081735 -0.415036 2.1876
H  0.57771 0.223623 2.102417
H  -3.138979 -0.333134 1.235838
H  -2.869705 -1.358422 -0.189082
H  3.272887 -0.516571 0.061696
H  -4.718951 1.13216 -0.113903
H  -4.448193 0.098768 -1.545081
H  -5.260345 -0.570492 -0.101594
