program: Gaussian 09
title: 000095842
version: EM64L-G09RevD.01
frameworkgroup: C1[X(C6H7N5O2)]
method: RPBEPBE
basis: SDD
operation: Freq
keyword: #pfreq=noraman
keyword: PBEPBE/SDD
title: #p freq=noraman PBEPBE/SDD
converged: NO NO NO NO
title: Mulliken charges:
elementType: O O N N N N N C C C C C C H H H H H H H
charge: -0.253523 -0.221373 -0.153429 -0.238226 -0.047161 0.028232 -0.347479 0.122001 -0.056163 0.241108 0.211428 -0.607975 -0.595515 0.248594 0.275487 0.248598 0.253931 0.270360 0.253846 0.367260
chargesum: 0.00000
title: Mulliken charges with hydrogens summed into heavy atoms:
elementType: O O N N N N N C C C C C C
charge: -0.253523 -0.221373 -0.153429 -0.238226 -0.047161 0.028232 0.019780 0.122001 -0.056163 0.241108 0.211428 0.164704 0.182622
polarizability: 1.37975135e+02 1.99170161e+00 1.21181419e+02 9.61944913e-03 -1.70531539e-03 5.15303545e+01
1716.lowfreq: 0.0005 0.0006 0.0007 4.7643 7.2268 10.6152 82.8014 109.9022 122.4714
frequency: 82.7657 109.8962 122.4535 129.7002 162.2810 190.5431 274.1369 300.4963 311.9394 362.7881 371.1549 391.6708 425.2949 471.2471 533.5135 589.3045 643.6618 662.7095 675.6923 708.0423 768.6475 773.1078 919.1725 924.6833 972.2441 1036.8965 1064.6869 1105.0632 1131.0881 1133.9206 1148.8905 1211.1143 1230.0169 1263.7972 1293.0006 1339.9499 1404.2606 1420.6953 1428.7707 1472.8080 1477.1762 1478.1257 1481.6549 1498.1941 1583.0741 1612.8530 1653.4411 3002.9110 3013.4954 3092.0904 3106.7993 3136.0084 3138.4058 3624.1950
redmass: 5.2066 3.3623 1.1158 1.1017 3.8279 9.4819 3.5340 5.2981 3.8411 4.7647 8.0373 8.3639 8.7391 9.0161 7.2486 4.4631 8.1540 8.9971 1.4072 8.9721 11.2294 4.9622 5.9140 6.2579 3.8596 3.4324 4.2822 3.9469 1.3067 1.2966 6.1975 3.8989 2.9328 6.0838 6.4889 8.0852 1.4272 1.2278 1.2151 1.2969 1.0462 1.0940 1.0417 2.7180 8.2230 10.8843 10.3015 1.0339 1.0329 1.1028 1.1023 1.1008 1.1025 1.0839
irintensity: 0.5552 7.7500 0.8711 0.4999 2.1544 2.9758 4.8056 0.0121 1.3830 10.2144 0.1271 28.5206 5.2389 13.4374 1.5307 19.1678 9.3885 0.1369 99.9423 27.9761 4.1280 0.4126 7.2301 8.9872 34.4145 99.9723 2.7960 28.4129 0.1523 0.1901 3.0941 38.9929 5.4259 110.1017 103.7378 3.6772 2.6275 21.5684 82.6772 11.4240 19.2503 6.8949 18.5133 80.2157 105.6029 635.3716 230.3841 31.2492 21.2583 17.3197 15.4010 0.3251 0.7576 172.6523
temp: 298.150 k
press: 1.00000 atm
elementType: 8 8 7 7 7 7 7 6 6 6 6 6 6 1 1 1 1 1 1 1
symmnumber: 1
zpe: 379578.3 jmol-1
zpe.correction: 0.144574 hartree
zpe.thermalcorrener: 0.155724 hartree
zpe.thermalcorrenthalpy: 0.156668 hartree
zpe.thermalcorrgfe: 0.107613 hartree
zpe.sumelectzpe: -656.093473 hartree
zpe.sumelectthermal: -656.082322 hartree
zpe.sumelectthermalent: -656.081378 hartree
zpe.sumelectthermalfe: -656.130434 hartree
dipole: -2.5570 2.7022 -0.0009
dipole: 3.7202
quadrupole: -65.3152 -86.7456 -73.6208
quadrupole: -4.8399 -0.0027 0.0013
quadrupole: 9.9120 -11.5184 1.6064 -4.8399 -0.0027 0.0013
hfenergy: -656.2380465 hartree
pointgroup: C01 [X(C6H7N5O2)]
dipole: -0.8638668 1.181526 -0.0003427 debye
dipolederiv: -1.1612418 -0.3170384 -0.0001286 -0.3513502 -0.733131 -0.0000559 -0.0000603 -0.0000675 -0.3583365 -0.5195477 0.0815938 -0.0000409 -0.0192615 -1.2367661 0.0000493 0.0001578 0.0001472 -0.332586 -1.2446452 -0.1478733 -0.0000889 0.085798 -0.7513869 -0.000106 -0.0000613 -0.0000081 -0.1645883 -0.7943781 -0.3889981 -0.0001822 -0.2796522 -1.2826309 0.000095 0.0004906 -0.0001887 -0.2203764 -0.2237499 -0.2320732 -0.000052 0.3400836 -0.2375895 0.0000026 0.0000143 0.0000061 -0.1455139 0.3430027 -0.1657312 -0.0000171 -0.2785749 -0.2838455 -0.0000251 -0.0000694 0.0000314 -0.0969791 -0.6606887 0.1771375 0.0000137 0.1167972 0.1798634 0.0000288 0.0000764 0.0000201 -0.2189051 0.746398 0.5376284 0.0000629 0.5370243 0.2789165 0.0000418 0.0000973 -0.0000189 0.1307808 -0.5301728 0.3168103 0.0000487 -0.1261006 -0.2348724 0.0000275 -0.0000784 -0.000017 0.0002155 1.7552167 0.1133749 0.0003093 0.0383296 1.484523 0.0001958 0.0001836 0.0002328 0.274948 1.252745 0.1504201 -0.0000004 0.1576987 1.6311713 -0.0002829 0.0000098 -0.0003405 0.258191 0.0057368 -0.0037512 0.0000038 -0.0659289 0.5292701 0.0000768 -0.0000393 0.0001026 0.2137078 0.3117806 -0.1269455 0.0004394 -0.1880193 0.1060622 -0.0002316 0.0001479 -0.0003806 0.1967879 0.0695124 0.0875872 -0.0936891 0.0180747 0.0096128 0.0091014 -0.0718634 0.0667969 -0.0418303 0.0217764 -0.1285012 0.0000598 -0.0023588 0.13197 -0.0000079 0.0000448 -0.0000129 0.1333717 0.0695978 0.087536 0.0936359 0.0180478 0.0095473 -0.0091222 0.0718188 -0.0668903 -0.0419888 0.0019301 0.0259857 0.052434 -0.0307409 0.10428 0.0752683 0.0778675 0.0275365 -0.0344676 0.166458 -0.0803945 -0.00046 0.0587348 -0.0124138 -0.0007221 -0.0002885 -0.0003754 0.1297368 0.0016074 0.0264932 -0.0523515 -0.0294693 0.1044407 -0.0743268 -0.0784151 -0.0265601 -0.0361463 0.3886624 -0.0132605 0.0000032 0.0008678 0.2029789 -0.0000067 -0.0000332 -0.0000134 0.3539785 unknown
polarizability: 138.2063828|-0.1728992|120.9501717|0.0093275|-0.002905|51.5303545 unknown
InChI: InChI=1S/C6H7N5O2/c1-10-4-3(7-9-8-4)5(12)11(2)6(10)13/h9H,1-2H3
charge 0 multiplicity 1
20 atoms
O  2.564473 1.366583 0.000288
O  0.369309 -2.798154 0.000255
N  0.223833 1.410656 0.00011
N  1.435351 -0.689219 -0.000299
N  -2.221061 1.163628 0.000076
N  -2.263087 -1.192786 -0.000009
N  -2.953538 -0.014243 0.000024
C  -0.942249 0.671467 0.000051
C  -0.959102 -0.756054 0.000005
C  1.47139 0.739625 0.000131
C  0.275104 -1.542838 0.000069
C  0.182736 2.885917 0.000284
C  2.766796 -1.341459 -0.000488
H  -0.345678 3.250803 -0.897132
H  1.221212 3.248388 -0.000013
H  -0.345051 3.250667 0.898126
H  3.33806 -1.034919 -0.891736
H  2.599913 -2.428611 -0.004675
H  3.335293 -1.041932 0.894978
H  -3.971705 0.002881 -0.000045
