program: Gaussian 09
title: 000095874
version: EM64L-G09RevD.01
frameworkgroup: C1[X(C11H20O5)]
method: RPBEPBE
basis: SDD
operation: Freq
keyword: #pfreq=noraman
keyword: PBEPBE/SDD
title: #p freq=noraman PBEPBE/SDD
converged: YES YES NO NO
title: Mulliken charges:
elementType: O O O O O C C C C C C C C C C C H H H H H H H H H H H H H H H H H H H H
charge: -0.284432 -0.264538 -0.129985 -0.253459 -0.245410 0.276542 0.114199 -0.752346 -0.620094 -0.251153 -0.230711 0.274152 -0.681068 -0.681798 -0.225120 -0.673447 0.246249 0.247696 0.237506 0.267184 0.277018 0.252375 0.221223 0.214985 0.204005 0.218663 0.225118 0.212383 0.225047 0.234702 0.202986 0.237214 0.228012 0.212078 0.236156 0.228069
chargesum: 0.00000
title: Mulliken charges with hydrogens summed into heavy atoms:
elementType: O O O O O C C C C C C C C C C C
charge: -0.284432 -0.264538 -0.129985 -0.253459 -0.245410 0.276542 0.114199 -0.020895 -0.075893 0.222444 0.188279 0.274152 -0.024904 -0.019062 0.240107 0.002856
polarizability: 1.70231868e+02 1.49269880e+00 1.29878124e+02 -5.10038433e-01 -2.63125630e+00 1.17279331e+02
1716.lowfreq: -6.7030 -0.0004 0.0007 0.0010 3.1076 9.1506 16.6703 29.4386 42.5891
frequency: 15.6831 29.3107 42.5578 46.2715 53.8315 68.9712 94.3282 103.8794 116.8668 130.0336 163.5874 172.0994 186.6791 207.4428 223.6629 234.5514 241.2828 256.4878 260.7551 303.2791 328.5104 338.7562 354.0811 370.3765 407.2979 482.8273 513.4976 554.6694 611.2596 626.5833 694.1717 770.5788 794.3374 798.1777 804.4942 816.9313 823.1594 842.6623 902.1732 916.4924 925.0709 945.7331 1009.0998 1024.1310 1034.1265 1043.1774 1088.1809 1094.0785 1108.4265 1112.7518 1116.9589 1135.2158 1135.6581 1143.9637 1151.5752 1199.3989 1242.6084 1249.0305 1257.5622 1262.3197 1281.9383 1356.7305 1362.8190 1375.1765 1384.9695 1394.7285 1396.1081 1401.0846 1435.8829 1458.8071 1460.1404 1460.3781 1463.3827 1473.2509 1474.9399 1479.7907 1482.3654 1486.0370 1495.3587 1503.1986 1622.1732 1656.9322 2962.5591 2972.0891 2991.0408 2993.6680 2997.1306 3005.0738 3013.9048 3021.6213 3022.1520 3041.7730 3073.4470 3089.0355 3090.7438 3093.7399 3094.6770 3096.7939 3102.5441 3106.3206 3109.8660 3112.0850
redmass: 3.6950 4.9684 3.4107 2.9056 3.1893 2.6987 4.6260 2.0379 2.5264 2.7997 3.1420 2.6262 2.5663 1.6710 2.2212 1.3370 1.3366 1.4825 1.8862 4.3903 2.9852 3.6312 3.4124 4.3159 2.2996 4.9084 4.2947 5.9318 4.1601 5.0315 4.2240 3.8252 2.9143 1.1163 2.7430 1.1031 1.1293 4.5875 3.9509 4.6183 2.4981 2.4273 2.3101 2.5410 2.6751 3.6624 2.2535 2.3576 2.1016 2.1565 1.9902 1.5631 1.4693 1.5138 3.0318 2.6600 1.9682 1.1580 1.1516 1.1443 1.6214 1.3986 1.3070 1.2479 1.2076 1.2703 1.2641 1.2632 1.0984 1.0485 1.0438 1.0452 1.0399 1.0631 1.0490 1.0461 1.0454 1.0669 1.0829 1.0825 9.7780 10.6643 1.0557 1.0606 1.0357 1.0362 1.0358 1.0357 1.0583 1.0887 1.0743 1.1034 1.1065 1.0989 1.0989 1.0985 1.1019 1.1014 1.1012 1.0989 1.1029 1.1011
irintensity: 1.4361 1.7683 0.6092 0.5423 1.4596 0.3041 0.0611 2.1753 1.3620 4.6789 3.9198 5.8739 3.6688 0.6869 9.9067 1.9233 0.0867 1.8950 16.9059 4.3183 0.7609 15.4063 5.4993 2.4730 1.5695 6.4851 2.1670 8.2563 16.2646 4.8916 0.5461 6.2452 3.6586 4.2672 16.0610 3.9753 3.3879 1.9240 103.4956 49.4930 28.5780 10.5351 49.5781 132.5965 45.1952 87.1158 144.4002 43.3194 27.1654 92.3693 116.7418 12.2227 7.5071 7.1951 38.4369 4.4364 291.2859 13.8176 2.4908 1.5813 112.8516 3.9165 1.5483 3.4332 26.6538 20.0956 28.4728 20.9403 20.6780 8.3003 5.3866 13.3964 12.1556 4.0072 5.8243 11.4009 7.5863 15.3065 4.9910 1.4168 213.1228 74.6597 46.3227 14.2017 24.9732 25.9526 20.9680 8.0244 16.0133 14.4770 17.1585 10.8875 5.4095 25.5776 36.1763 29.5247 4.3355 38.2051 36.1186 25.3105 41.1419 11.8362
temp: 298.150 k
press: 1.00000 atm
elementType: 8 8 8 8 8 6 6 6 6 6 6 6 6 6 6 6 1 1 1 1 1 1 1 1 1 1 1 1 1 1 1 1 1 1 1 1
symmnumber: 1
zpe: 782825.0 jmol-1
zpe.correction: 0.298162 hartree
zpe.thermalcorrener: 0.318304 hartree
zpe.thermalcorrenthalpy: 0.319248 hartree
zpe.thermalcorrgfe: 0.247067 hartree
zpe.sumelectzpe: -805.965566 hartree
zpe.sumelectthermal: -805.945425 hartree
zpe.sumelectthermalent: -805.944481 hartree
zpe.sumelectthermalfe: -806.016662 hartree
dipole: 0.1791 0.2483 2.3345
dipole: 2.3545
quadrupole: -73.4814 -100.5476 -96.8336
quadrupole: 0.2883 0.7796 -4.7699
quadrupole: 16.8061 -10.2600 -6.5461 0.2883 0.7796 -4.7699
hfenergy: -806.2637286 hartree
pointgroup: C01 [X(C11H20O5)]
dipole: -0.0714135 -0.2832209 0.8790849 debye
polarizability: 170.1537951|2.1061613|128.380223|1.0730874|4.9460614|118.8553053 unknown
InChI: InChI=1S/C11H20O5/c1-5-14-10(13)8-9(12)11(4,15-6-2)16-7-3/h5-8H2,1-4H3
charge 0 multiplicity 1
36 atoms
O  -1.602625 -1.32894 0.742525
O  -2.328747 0.805325 -0.138657
O  0.26274 1.452949 -0.412802
O  3.385654 0.14271 0.478801
O  2.187114 -1.428914 -0.756532
C  -1.457217 0.13531 0.803402
C  0.000006 0.542597 0.398478
C  -1.728281 0.499802 2.274414
C  1.107861 -0.25996 1.123085
C  -1.360328 -1.91928 -0.609329
C  -3.781651 0.641373 0.107612
C  2.250218 -0.598562 0.181304
C  -1.776587 -3.385791 -0.525929
C  -4.492721 1.134492 -1.151669
C  4.560728 -0.059852 -0.430246
C  5.67133 0.851948 0.078762
H  -0.955891 0.07156 2.934103
H  -2.699302 0.080875 2.586855
H  -1.743108 1.595964 2.397223
H  1.489666 0.357753 1.955529
H  0.674566 -1.190472 1.527063
H  -0.286226 -1.822912 -0.86849
H  -1.956468 -1.360138 -1.354459
H  -4.004432 -0.424527 0.314713
H  -4.079179 1.244618 0.989338
H  -2.845095 -3.478605 -0.263076
H  -1.183642 -3.918795 0.237506
H  -1.61071 -3.881105 -1.500018
H  -4.202217 0.528297 -2.026919
H  -4.225066 2.18475 -1.358726
H  -5.588967 1.068509 -1.024388
H  4.241336 0.189246 -1.457841
H  4.838029 -1.129158 -0.402574
H  6.563841 0.747229 -0.56474
H  5.351835 1.907641 0.060503
H  5.955936 0.590764 1.11238
