program: Gaussian 09
title: 000095840
version: EM64L-G09RevD.01
frameworkgroup: C1[X(C10H9NO3S)]
method: RPBEPBE
basis: SDD
operation: Freq
keyword: #p
keyword: freq=noraman
keyword: PBEPBE/SDD
title: #p freq=noraman PBEPBE/SDD
converged: YES YES NO NO
title: Mulliken charges:
elementType: S O O O N C C C C C C C C C C H H H H H H H H H
charge: 0.932877 -0.488228 -0.473696 -0.235548 -0.422967 -0.122430 0.278826 0.246222 -0.434008 -0.247722 -0.322880 -0.207229 -0.203680 -0.022669 -0.540720 0.272885 0.251776 0.273912 0.282263 0.249738 0.245977 0.241874 0.223916 0.221511
chargesum: 0.00000
title: Mulliken charges with hydrogens summed into heavy atoms:
elementType: S O O O N C C C C C C C C C C
charge: 0.932877 -0.488228 -0.473696 -0.235548 -0.422967 -0.122430 0.278826 0.246222 0.090652 0.026190 -0.040616 0.042509 0.042297 0.219205 -0.095293
polarizability: 2.07748536e+02 -1.15893482e+01 1.52210609e+02 5.99376179e+00 -1.57908592e-01 8.75743355e+01
1716.lowfreq: -8.4695 -5.0193 -3.6341 -0.0017 -0.0004 0.0008 30.5493 58.0195 68.2918
frequency: 30.5171 58.0078 68.2817 79.9525 97.7538 142.1481 169.4350 183.4244 214.9385 270.6048 282.2026 303.3502 331.9068 363.1095 418.2812 420.6840 437.8990 454.8281 496.3463 526.0345 635.9785 655.2600 656.9553 683.9007 740.0549 783.1995 798.2966 836.3201 890.5361 894.1128 956.4083 960.3225 968.1763 971.4482 979.1945 1003.2858 1007.9754 1010.1150 1028.4459 1112.5044 1139.0702 1169.9295 1184.7665 1238.2982 1263.7446 1282.8141 1310.9447 1334.5756 1396.8963 1428.9456 1432.3018 1446.5989 1449.8331 1580.6790 1599.1418 1615.9959 1660.8791 2974.6700 3036.1889 3095.8252 3123.8250 3147.7354 3159.4505 3169.7803 3180.2724 3207.4578
redmass: 4.0199 4.8162 2.4344 7.5634 6.3624 6.1949 4.2250 6.2904 4.9330 7.6486 6.4600 6.7026 6.4109 2.8684 8.3945 4.2306 7.5737 4.0228 4.5819 2.8279 3.9010 4.3661 3.2088 4.8085 3.1622 1.4916 4.8842 11.3636 1.3543 1.8184 5.8591 1.7033 2.8976 1.3896 1.9949 1.8532 2.4349 1.3774 2.1995 1.6492 1.9959 1.3249 1.8788 1.4806 1.4960 1.2482 2.4721 1.4679 9.4297 1.1755 2.2383 1.1398 2.3095 7.0086 9.5059 8.7149 4.6342 1.0580 1.1023 1.0608 1.0950 1.0868 1.0905 1.0957 1.1008 1.1144
irintensity: 1.1554 4.8913 1.3246 0.9191 0.0412 1.3256 5.2591 3.8269 0.8195 14.6761 9.1600 5.6144 7.0025 4.6299 60.1997 20.9854 31.4694 4.6284 16.0501 6.9200 5.3177 15.4746 11.5661 2.0617 25.2946 49.7393 1.6694 102.9685 1.4308 12.0100 72.7740 76.0217 38.8543 1.0293 4.1060 9.5518 9.0970 0.4995 3.4368 19.1089 1.3662 1.1973 0.6352 58.6011 4.0009 6.2287 199.6768 36.4889 1.6651 8.4301 16.1874 31.9322 14.1260 31.3931 126.5428 67.6583 5.9481 8.3970 6.4591 6.9247 5.3048 2.7471 1.9332 0.7322 15.8002 17.6680
temp: 298.150 k
press: 1.00000 atm
elementType: 16 8 8 8 7 6 6 6 6 6 6 6 6 6 6 1 1 1 1 1 1 1 1 1
symmnumber: 1
zpe: 445924.9 jmol-1
zpe.correction: 0.169844 hartree
zpe.thermalcorrener: 0.184167 hartree
zpe.thermalcorrenthalpy: 0.185111 hartree
zpe.thermalcorrgfe: 0.127525 hartree
zpe.sumelectzpe: -1063.675896 hartree
zpe.sumelectthermal: -1063.661574 hartree
zpe.sumelectthermalent: -1063.660629 hartree
zpe.sumelectthermalfe: -1063.718216 hartree
dipole: -3.8706 0.4344 -0.2014
dipole: 3.9001
quadrupole: -69.2310 -105.6550 -100.7069
quadrupole: 6.2956 1.4601 0.1470
quadrupole: 22.6333 -13.7907 -8.8426 6.2956 1.4601 0.1470
hfenergy: -1063.8457403 hartree
pointgroup: C01 [X(C10H9N1O3S1)]
dipole: 1.5097921 0.2735075 0.0143779 debye
dipolederiv: 1.4194741 0.0213417 -0.0025939 0.0999705 1.6254499 -0.0471015 -0.0913735 -0.0706099 1.3125467 -0.5494488 -0.0424396 0.0003355 -0.0529396 -0.6041079 -0.017025 -0.0331929 -0.1885096 -0.5490951 -0.5864896 -0.0425829 -0.0049155 -0.0264339 -0.5232304 0.0295486 0.0667038 0.1747226 -0.5937579 -0.5836629 -0.0006048 -0.0084653 -0.109504 -1.1462435 0.1515653 -0.0031537 0.1714252 -0.3423808 -1.0604922 -0.4348117 0.0899734 -0.3258097 -0.7612694 0.0615371 0.1953211 0.1568102 -0.449343 0.0532713 -0.0025292 0.0116865 -0.0606242 -0.0796543 -0.0177965 0.022484 -0.0147762 -0.2133716 -0.4912414 0.0360515 -0.0256942 0.2394665 -0.1348754 0.0440255 -0.1007422 0.0189294 0.0391191 1.173831 0.4963657 -0.0559682 0.3067295 1.2997339 -0.2132636 0.0018598 -0.2066487 0.2296879 0.730264 -0.121272 0.0532246 -0.0183057 -0.0986296 0.0910061 -0.0297045 -0.0241718 0.207572 -0.2912763 0.0790093 -0.0200273 -0.2219249 0.0515341 -0.0258679 0.0228364 -0.0183567 -0.0603427 -0.0463955 -0.0125118 0.0043605 0.0162457 0.0958809 -0.0249106 0.0001058 -0.0280756 -0.0794207 0.0922866 -0.1161678 0.0286049 0.0542165 -0.0011427 -0.0164001 0.0051454 -0.0229262 -0.1166267 0.1403054 0.1099817 -0.0032466 0.0807527 -0.0332033 -0.0093257 0.0038843 -0.007392 -0.1263628 -0.0719911 0.1269708 -0.0431383 0.1371623 -0.0473342 0.0443487 -0.1527749 0.0526752 0.1061762 -0.2525226 0.1133774 -0.0479317 0.1733788 -0.2129459 0.0557634 0.0091425 0.0400382 0.095095 -0.0015903 -0.0227914 0.0158165 0.0307721 0.0009855 0.0264993 0.0147979 0.0282342 0.1165098 -0.0489118 -0.0141773 -0.0241261 -0.0376204 0.0871074 -0.1140525 -0.0220593 -0.0360169 -0.045116 0.1116938 -0.0384833 0.0033164 0.0088746 0.0147304 0.0198275 -0.0074314 0.0199472 0.1498616 0.1030906 0.025052 -0.0074213 -0.0282925 0.0135311 0.0196369 0.0007903 0.0230538 0.1566184 -0.0566669 0.0654588 -0.0199086 0.0585388 0.0534588 0.0186188 -0.0184815 0.0198292 0.158161 -0.0627363 -0.0693043 -0.000488 -0.0752137 0.0625802 0.0099252 0.0001214 0.0100134 0.155409 0.1012499 -0.0546003 -0.0385959 -0.0861782 0.0828638 -0.049022 0.0271047 -0.0461408 -0.0648054 0.0321932 -0.060147 0.0850039 -0.1010706 0.1315888 0.0172414 0.1104466 0.0232869 -0.0084824 0.1457658 -0.0411855 0.0101986 -0.0621907 0.1231919 -0.0547786 -0.0218303 -0.0753408 -0.0776515 unknown
polarizability: 206.1921079|15.5297981|152.3172337|1.8355523|-10.1785084|89.0241392 unknown
InChI: InChI=1S/C10H9NO3S/c1-2-7-11-10(12)8-5-3-4-6-9(8)15(11,13)14/h2-6H,1,7H2
charge 0 multiplicity 1
24 atoms
S  -0.547826 -1.278687 0.170557
O  -0.938118 -2.167518 -1.128385
O  -0.93755 -1.828967 1.642712
O  -0.258558 2.663294 -0.475657
N  -1.135093 0.515712 -0.104045
C  1.225469 -0.631472 0.142497
C  1.236558 0.758974 -0.054825
C  -0.093347 1.432991 -0.235154
C  -2.552138 0.774214 -0.418939
C  2.369508 -1.413417 0.321005
C  2.478998 1.425119 -0.088547
C  3.612579 -0.730541 0.283486
C  3.66322 0.671181 0.08082
C  -3.488789 0.322107 0.680736
C  -4.559983 -0.479882 0.467931
H  -2.605436 1.873492 -0.559826
H  -2.816903 0.29353 -1.380463
H  2.318238 -2.494381 0.47977
H  2.494046 2.508287 -0.245817
H  4.540275 -1.297137 0.41257
H  4.633872 1.176553 0.055759
H  -3.264163 0.699157 1.687364
H  -5.22993 -0.765503 1.285489
H  -4.790331 -0.883704 -0.525838
