program: Gaussian 09
title: 000095815
version: EM64L-G09RevD.01
frameworkgroup: C1[X(C11H16N2O)]
method: RPBEPBE
basis: SDD
operation: Freq
keyword: #p
keyword: freq=noraman
keyword: PBEPBE/SDD
title: #p freq=noraman PBEPBE/SDD
converged: YES YES NO NO
title: Mulliken charges:
elementType: O N N C C C C C C C C C C C H H H H H H H H H H H H H H H H
charge: -0.259797 0.014766 -0.004662 -0.036184 -0.415754 -0.707583 -0.706470 -0.292797 0.399470 -0.346810 -0.294037 -0.430283 -0.180058 -0.328447 0.206183 0.214498 0.214879 0.214438 0.209306 0.215883 0.208495 0.214665 0.215718 0.222947 0.224520 0.238575 0.237497 0.275053 0.232800 0.243190
chargesum: 0.00000
title: Mulliken charges with hydrogens summed into heavy atoms:
elementType: O N N C C C C C C C C C C C
charge: -0.259797 0.014766 -0.004662 0.169999 0.013623 -0.067957 -0.067592 0.154670 0.399470 -0.108234 -0.056540 -0.155230 0.052742 -0.085257
polarizability: 2.44389122e+02 -1.82869227e+00 1.24444124e+02 1.07976542e-01 6.24198623e-01 8.28053883e+01
1716.lowfreq: -14.6243 -0.0010 -0.0008 -0.0008 1.4335 5.0669 15.7840 29.4520 47.4064
frequency: 12.6741 28.8065 47.2560 70.9107 94.9545 140.5337 143.5563 174.2896 186.9571 217.5456 240.2318 281.0522 308.0491 347.6716 355.3701 397.8907 402.2039 505.2568 507.2373 543.2175 609.3684 652.6895 716.5151 784.5731 788.7753 811.3149 837.5146 904.7212 913.1326 921.6150 936.6810 952.4826 955.1178 960.1023 978.9516 985.6884 990.1475 1001.9414 1019.6631 1028.7983 1117.0737 1138.6539 1150.2251 1193.5484 1198.5959 1203.5564 1225.0763 1278.1594 1284.6659 1307.1899 1330.6388 1332.6234 1332.7706 1344.0427 1377.4557 1380.5914 1397.9355 1411.8324 1453.6081 1465.2966 1466.6095 1476.5116 1484.6406 1487.8221 1491.6798 1534.5739 1573.2807 1584.3230 2966.8987 2970.3367 2973.5909 2989.0962 3000.6246 3036.7075 3051.4280 3062.4643 3066.9098 3070.7791 3072.2915 3074.8299 3127.3811 3136.8679 3148.7556 3167.6465
redmass: 3.0988 4.1534 4.7132 2.8349 2.0564 4.1423 4.2956 3.8332 4.5018 1.1364 1.0480 3.6979 4.1886 2.6806 2.0837 3.2484 3.6437 4.8466 4.0419 2.9744 7.4923 5.8125 1.8566 1.1780 2.9453 1.6408 5.5179 6.6256 1.1957 1.3609 1.3706 1.2994 1.6012 2.8605 2.9638 1.3989 1.7089 3.6139 2.1145 2.9490 1.5873 2.0255 1.6962 1.9108 1.3175 1.2355 1.7413 1.1231 1.5804 6.0026 1.6497 1.2749 1.4650 1.5112 1.2130 1.4465 1.2223 2.2063 2.3393 1.0687 1.0605 1.0546 1.0642 1.0529 1.0712 5.4050 6.3323 5.7192 1.0790 1.0354 1.0364 1.0642 1.0556 1.1023 1.0891 1.1005 1.1013 1.0988 1.0988 1.1067 1.0885 1.0908 1.0924 1.0999
irintensity: 0.8677 1.2810 0.4017 0.3922 0.1010 0.8165 3.1441 7.6733 0.4749 0.1607 0.1337 0.9753 1.0499 0.0694 0.1087 4.4578 0.4132 19.1139 3.5241 39.9600 2.0339 9.4906 39.5481 2.2129 0.7890 28.9011 8.5023 179.6554 3.8918 5.3570 7.1386 0.8191 21.6768 167.3885 56.9214 2.6838 0.0735 9.4843 29.5753 4.8001 7.6233 1.0525 5.3484 8.9782 1.2664 0.5011 11.1003 0.1241 12.3122 2.3119 18.1877 4.7339 1.6050 0.4952 21.5693 17.0601 14.9097 18.6112 17.1716 7.7623 3.4392 3.6538 33.3127 10.6233 10.2237 6.1779 19.9949 1.9602 16.0453 38.9277 18.4186 28.3999 68.4712 3.6104 17.0302 26.6535 4.2526 73.2592 109.2559 61.0848 4.5589 17.5796 6.9066 29.3688
temp: 298.150 k
press: 1.00000 atm
elementType: 8 7 7 6 6 6 6 6 6 6 6 6 6 6 1 1 1 1 1 1 1 1 1 1 1 1 1 1 1 1
symmnumber: 1
zpe: 656122.1 jmol-1
zpe.correction: 0.249904 hartree
zpe.thermalcorrener: 0.264807 hartree
zpe.thermalcorrenthalpy: 0.265751 hartree
zpe.thermalcorrgfe: 0.205236 hartree
zpe.sumelectzpe: -612.364817 hartree
zpe.sumelectthermal: -612.349913 hartree
zpe.sumelectthermalent: -612.348969 hartree
zpe.sumelectthermalfe: -612.409484 hartree
dipole: 1.2280 -2.6362 -0.0657
dipole: 2.9090
quadrupole: -69.4097 -86.5456 -87.1242
quadrupole: 12.6425 0.1902 0.0140
quadrupole: 11.6168 -5.5191 -6.0977 12.6425 0.1902 0.0140
hfenergy: -612.6147204 hartree
pointgroup: C01 [X(C11H16N2O1)]
dipole: 0.5000414 -1.0293733 -0.0126777 debye
polarizability: 244.4168791|0.1394026|124.425683|-0.0488166|0.0756773|82.7960721 unknown
InChI: InChI=1S/C11H16N2O/c1-10(2)5-7-14-13-9-11-4-3-6-12-8-11/h3-4,6,8-10H,5,7H2,1-2H3
charge 0 multiplicity 1
30 atoms
O  1.253403 -0.877279 -0.003125
N  0.031809 -0.092264 0.0079
N  -3.906984 1.58556 0.016541
C  5.00693 -0.0560 -0.027227
C  3.661642 -0.839191 -0.043184
C  5.168633 0.868991 -1.259069
C  5.219247 0.730787 1.289825
C  2.414665 0.050356 0.005015
C  -2.380166 -0.342069 0.006288
C  -1.017263 -0.888527 0.002139
C  -3.493992 -1.225225 0.00176
C  -2.652471 1.059906 0.013576
C  -4.80051 -0.693112 0.004712
C  -4.961676 0.711052 0.012089
H  5.804477 -0.826098 -0.084632
H  3.63283 -1.531514 0.820884
H  3.612978 -1.461707 -0.958016
H  6.186344 1.299981 -1.29216
H  4.454067 1.71289 -1.23006
H  5.003318 0.315396 -2.20244
H  4.507102 1.572482 1.381122
H  6.238885 1.156659 1.329388
H  5.089135 0.077947 2.173261
H  2.367895 0.661731 0.924672
H  2.337024 0.714286 -0.874839
H  -0.895023 -1.984733 -0.007647
H  -3.333816 -2.310115 -0.003995
H  -1.822413 1.774205 0.016864
H  -5.677076 -1.348413 0.00131
H  -5.958593 1.165818 0.014446
